{"text_format":"1","workbook":"xlsx","n_sheets":9,"sheets":["カレンダー (A601-4)","祝日など","9-10時限","7-8時限","5-6時限","昼休憩","3-4時限","1-2時限","セミナー"],"not_rendered":{"charts":0,"images":0,"macros":1,"external_links":1,"defined_names":0,"comments":0,"pivot_tables":0},"unopened":[],"bounds":{"document_bytes":16777216,"sheet_cells":100000,"rows_first":2000,"rows_last":500,"rows_between":2000,"halvings":0,"cell_chars":16384,"cell_head_chars":4096},"cells_cut":0,"cells_raw":0,"read":"whole","date_system":"1900"}

{"sheet":"カレンダー (A601-4)","index":0,"n_rows":35,"n_cols":10,"rows_kept":35,"cut":false,"hidden":false,"merged":[[12,0,12,1],[0,4,0,9],[1,4,1,8],[2,6,3,6],[4,0,4,1],[5,0,5,1],[6,0,6,1],[7,0,7,1],[8,0,8,1],[9,0,9,1],[10,0,10,1],[11,0,11,1],[24,0,24,1],[13,0,13,1],[14,0,14,1],[15,0,15,1],[16,0,16,1],[17,0,17,1],[18,0,18,1],[19,0,19,1],[20,0,20,1],[21,0,21,1],[22,0,22,1],[23,0,23,1],[31,0,31,1],[32,0,32,1],[33,0,33,1],[34,0,34,1],[25,0,25,1],[26,0,26,1],[27,0,27,1],[28,0,28,1],[29,0,29,1],[30,0,30,1]]}
[{"$f":"B2","v":"2025-12-01"},null,"年",null,"A601-4号室（第1セミナー室）"]
[null,"2025-12-01","月",null,"※予定を入れる/変更する場合は，地事務までご連絡ください。",null,null,null,null,"（収容人数：24名）"]
[null,null,"時限",null,"１・２","３・４","昼休憩","５・６","７・８","９・１０"]
[null,null,"日","曜日","08:45-10:15","10:30-12:00",null,"12:50-14:20","14:35-16:05","16:20-17:50"]
[{"$f":"IFERROR(VLOOKUP(C5,祝日など!$A$2:$B$55,2,FALSE),\"\")&IFERROR(VLOOKUP(C5,祝日など!$D$2:$E$15,2,FALSE),\"\")","v":""},null,{"$f":"B2","v":"2025-12-01"},{"$f":"C5","v":45992},{"$f":"IFERROR(VLOOKUP(C5,テーブル4[],2,0),\"\")","v":""},{"$f":"IFERROR(VLOOKUP(C5,テーブル5[],2,FALSE),\"\")","v":""},{"$f":"IFERROR(VLOOKUP(C5,テーブル84[],2,FALSE),\"\")","v":""},{"$f":"IFERROR(VLOOKUP(C5,テーブル6[],2,FALSE),\"\")","v":""},{"$f":"IFERROR(VLOOKUP(C5,テーブル7[],2,FALSE),\"\")","v":""},{"$f":"IFERROR(VLOOKUP(C5,テーブル8[],2,FALSE),\"\")","v":""}]
[{"$f":"IFERROR(VLOOKUP(C6,祝日など!$A$2:$B$55,2,FALSE),\"\")&IFERROR(VLOOKUP(C6,祝日など!$D$2:$E$15,2,FALSE),\"\")","v":"第4ターム開始"},null,{"$f":"C5+1","v":"2025-12-02"},{"$f":"C6","v":45993},{"$f":"IFERROR(VLOOKUP(C6,テーブル4[],2,0),\"\")","v":"有機宇宙地球化学セミナー\n10時～（薮田）"},{"$f":"IFERROR(VLOOKUP(C6,テーブル5[],2,FALSE),\"\")","v":"有機宇宙地球化学セミナー\n（薮田）"},{"$f":"IFERROR(VLOOKUP(C6,テーブル84[],2,FALSE),\"\")","v":""},{"$f":"IFERROR(VLOOKUP(C6,テーブル6[],2,FALSE),\"\")","v":""},{"$f":"IFERROR(VLOOKUP(C6,テーブル7[],2,FALSE),\"\")","v":""},{"$f":"IFERROR(VLOOKUP(C6,テーブル8[],2,FALSE),\"\")","v":""}]
[{"$f":"IFERROR(VLOOKUP(C7,祝日など!$A$2:$B$55,2,FALSE),\"\")&IFERROR(VLOOKUP(C7,祝日など!$D$2:$E$15,2,FALSE),\"\")","v":""},null,{"$f":"C6+1","v":"2025-12-03"},45994,{"$f":"IFERROR(VLOOKUP(C7,テーブル4[],2,0),\"\")","v":""},{"$f":"IFERROR(VLOOKUP(C7,テーブル5[],2,FALSE),\"\")","v":""},{"$f":"IFERROR(VLOOKUP(C7,テーブル84[],2,FALSE),\"\")","v":""},{"$f":"IFERROR(VLOOKUP(C7,テーブル6[],2,FALSE),\"\")","v":""},{"$f":"IFERROR(VLOOKUP(C7,テーブル7[],2,FALSE),\"\")","v":"LIRGセミナー\n（柴田・秋澤・平山）"},{"$f":"IFERROR(VLOOKUP(C7,テーブル8[],2,FALSE),\"\")","v":"LIRGセミナー\n（柴田・秋澤・平山）"}]
[{"$f":"IFERROR(VLOOKUP(C8,祝日など!$A$2:$B$55,2,FALSE),\"\")&IFERROR(VLOOKUP(C8,祝日など!$D$2:$E$15,2,FALSE),\"\")","v":""},null,"2025-12-04",45995,{"$f":"IFERROR(VLOOKUP(C8,テーブル4[],2,0),\"\")","v":""},{"$f":"IFERROR(VLOOKUP(C8,テーブル5[],2,FALSE),\"\")","v":""},{"$f":"IFERROR(VLOOKUP(C8,テーブル84[],2,FALSE),\"\")","v":""},{"$f":"IFERROR(VLOOKUP(C8,テーブル6[],2,FALSE),\"\")","v":""},{"$f":"IFERROR(VLOOKUP(C8,テーブル7[],2,FALSE),\"\")","v":"内物セミナー\n（須田・中久喜）"},{"$f":"IFERROR(VLOOKUP(C8,テーブル8[],2,FALSE),\"\")","v":"岩石変形セミナー\n（片山・岡﨑）"}]
[{"$f":"IFERROR(VLOOKUP(C9,祝日など!$A$2:$B$55,2,FALSE),\"\")&IFERROR(VLOOKUP(C9,祝日など!$D$2:$E$15,2,FALSE),\"\")","v":""},null,"2025-12-05",45996,{"$f":"IFERROR(VLOOKUP(C9,テーブル4[],2,0),\"\")","v":"生命・環境セミナー\n（白石）"},{"$f":"IFERROR(VLOOKUP(C9,テーブル5[],2,FALSE),\"\")","v":"生命・環境セミナー\n（白石）"},{"$f":"IFERROR(VLOOKUP(C9,テーブル84[],2,FALSE),\"\")","v":""},{"$f":"IFERROR(VLOOKUP(C9,テーブル6[],2,FALSE),\"\")","v":"地球外物質セミナー\n（宮原・小池）"},{"$f":"IFERROR(VLOOKUP(C9,テーブル7[],2,FALSE),\"\")","v":""},{"$f":"IFERROR(VLOOKUP(C9,テーブル8[],2,FALSE),\"\")","v":""}]
[{"$f":"IFERROR(VLOOKUP(C10,祝日など!$A$2:$B$55,2,FALSE),\"\")&IFERROR(VLOOKUP(C10,祝日など!$D$2:$E$15,2,FALSE),\"\")","v":""},null,"2025-12-06",45997,{"$f":"IFERROR(VLOOKUP(C10,テーブル4[],2,0),\"\")","v":""},{"$f":"IFERROR(VLOOKUP(C10,テーブル5[],2,FALSE),\"\")","v":""},{"$f":"IFERROR(VLOOKUP(C10,テーブル84[],2,FALSE),\"\")","v":""},{"$f":"IFERROR(VLOOKUP(C10,テーブル6[],2,FALSE),\"\")","v":""},{"$f":"IFERROR(VLOOKUP(C10,テーブル7[],2,FALSE),\"\")","v":""},{"$f":"IFERROR(VLOOKUP(C10,テーブル8[],2,FALSE),\"\")","v":""}]
[{"$f":"IFERROR(VLOOKUP(C11,祝日など!$A$2:$B$55,2,FALSE),\"\")&IFERROR(VLOOKUP(C11,祝日など!$D$2:$E$15,2,FALSE),\"\")","v":""},null,"2025-12-07",45998,{"$f":"IFERROR(VLOOKUP(C11,テーブル4[],2,0),\"\")","v":""},{"$f":"IFERROR(VLOOKUP(C11,テーブル5[],2,FALSE),\"\")","v":""},{"$f":"IFERROR(VLOOKUP(C11,テーブル84[],2,FALSE),\"\")","v":""},{"$f":"IFERROR(VLOOKUP(C11,テーブル6[],2,FALSE),\"\")","v":""},{"$f":"IFERROR(VLOOKUP(C11,テーブル7[],2,FALSE),\"\")","v":""},{"$f":"IFERROR(VLOOKUP(C11,テーブル8[],2,FALSE),\"\")","v":""}]
[{"$f":"IFERROR(VLOOKUP(C12,祝日など!$A$2:$B$55,2,FALSE),\"\")&IFERROR(VLOOKUP(C12,祝日など!$D$2:$E$15,2,FALSE),\"\")","v":""},null,"2025-12-08",45999,{"$f":"IFERROR(VLOOKUP(C12,テーブル4[],2,0),\"\")","v":""},{"$f":"IFERROR(VLOOKUP(C12,テーブル5[],2,FALSE),\"\")","v":""},{"$f":"IFERROR(VLOOKUP(C12,テーブル84[],2,FALSE),\"\")","v":""},{"$f":"IFERROR(VLOOKUP(C12,テーブル6[],2,FALSE),\"\")","v":""},{"$f":"IFERROR(VLOOKUP(C12,テーブル7[],2,FALSE),\"\")","v":""},{"$f":"IFERROR(VLOOKUP(C12,テーブル8[],2,FALSE),\"\")","v":""}]
[{"$f":"IFERROR(VLOOKUP(C13,祝日など!$A$2:$B$55,2,FALSE),\"\")&IFERROR(VLOOKUP(C13,祝日など!$D$2:$E$15,2,FALSE),\"\")","v":""},null,"2025-12-09",46000,{"$f":"IFERROR(VLOOKUP(C13,テーブル4[],2,0),\"\")","v":"有機宇宙地球化学セミナー\n10時～（薮田）"},{"$f":"IFERROR(VLOOKUP(C13,テーブル5[],2,FALSE),\"\")","v":"有機宇宙地球化学セミナー\n（薮田）"},{"$f":"IFERROR(VLOOKUP(C13,テーブル84[],2,FALSE),\"\")","v":""},{"$f":"IFERROR(VLOOKUP(C13,テーブル6[],2,FALSE),\"\")","v":""},{"$f":"IFERROR(VLOOKUP(C13,テーブル7[],2,FALSE),\"\")","v":""},{"$f":"IFERROR(VLOOKUP(C13,テーブル8[],2,FALSE),\"\")","v":""}]
[{"$f":"IFERROR(VLOOKUP(C14,祝日など!$A$2:$B$55,2,FALSE),\"\")&IFERROR(VLOOKUP(C14,祝日など!$D$2:$E$15,2,FALSE),\"\")","v":""},null,"2025-12-10",46001,{"$f":"IFERROR(VLOOKUP(C14,テーブル4[],2,0),\"\")","v":""},{"$f":"IFERROR(VLOOKUP(C14,テーブル5[],2,FALSE),\"\")","v":""},{"$f":"IFERROR(VLOOKUP(C14,テーブル84[],2,FALSE),\"\")","v":""},{"$f":"IFERROR(VLOOKUP(C14,テーブル6[],2,FALSE),\"\")","v":""},{"$f":"IFERROR(VLOOKUP(C14,テーブル7[],2,FALSE),\"\")","v":"LIRGセミナー\n（柴田・秋澤・平山）"},{"$f":"IFERROR(VLOOKUP(C14,テーブル8[],2,FALSE),\"\")","v":"LIRGセミナー\n（柴田・秋澤・平山）"}]
[{"$f":"IFERROR(VLOOKUP(C15,祝日など!$A$2:$B$55,2,FALSE),\"\")&IFERROR(VLOOKUP(C15,祝日など!$D$2:$E$15,2,FALSE),\"\")","v":""},null,"2025-12-11",46002,{"$f":"IFERROR(VLOOKUP(C15,テーブル4[],2,0),\"\")","v":""},{"$f":"IFERROR(VLOOKUP(C15,テーブル5[],2,FALSE),\"\")","v":""},{"$f":"IFERROR(VLOOKUP(C15,テーブル84[],2,FALSE),\"\")","v":""},{"$f":"IFERROR(VLOOKUP(C15,テーブル6[],2,FALSE),\"\")","v":""},{"$f":"IFERROR(VLOOKUP(C15,テーブル7[],2,FALSE),\"\")","v":"内物セミナー\n（須田・中久喜）"},{"$f":"IFERROR(VLOOKUP(C15,テーブル8[],2,FALSE),\"\")","v":"岩石変形セミナー\n（片山・岡﨑）"}]
[{"$f":"IFERROR(VLOOKUP(C16,祝日など!$A$2:$B$55,2,FALSE),\"\")&IFERROR(VLOOKUP(C16,祝日など!$D$2:$E$15,2,FALSE),\"\")","v":""},null,"2025-12-12",46003,{"$f":"IFERROR(VLOOKUP(C16,テーブル4[],2,0),\"\")","v":"生命・環境セミナー\n（白石）"},{"$f":"IFERROR(VLOOKUP(C16,テーブル5[],2,FALSE),\"\")","v":"生命・環境セミナー\n（白石）"},{"$f":"IFERROR(VLOOKUP(C16,テーブル84[],2,FALSE),\"\")","v":""},{"$f":"IFERROR(VLOOKUP(C16,テーブル6[],2,FALSE),\"\")","v":"地球外物質セミナー\n（宮原・小池）"},{"$f":"IFERROR(VLOOKUP(C16,テーブル7[],2,FALSE),\"\")","v":"㈱コベルコ科研 会社説明会"},{"$f":"IFERROR(VLOOKUP(C16,テーブル8[],2,FALSE),\"\")","v":""}]
[{"$f":"IFERROR(VLOOKUP(C17,祝日など!$A$2:$B$55,2,FALSE),\"\")&IFERROR(VLOOKUP(C17,祝日など!$D$2:$E$15,2,FALSE),\"\")","v":""},null,"2025-12-13",46004,{"$f":"IFERROR(VLOOKUP(C17,テーブル4[],2,0),\"\")","v":""},{"$f":"IFERROR(VLOOKUP(C17,テーブル5[],2,FALSE),\"\")","v":""},{"$f":"IFERROR(VLOOKUP(C17,テーブル84[],2,FALSE),\"\")","v":""},{"$f":"IFERROR(VLOOKUP(C17,テーブル6[],2,FALSE),\"\")","v":""},{"$f":"IFERROR(VLOOKUP(C17,テーブル7[],2,FALSE),\"\")","v":""},{"$f":"IFERROR(VLOOKUP(C17,テーブル8[],2,FALSE),\"\")","v":""}]
[{"$f":"IFERROR(VLOOKUP(C18,祝日など!$A$2:$B$55,2,FALSE),\"\")&IFERROR(VLOOKUP(C18,祝日など!$D$2:$E$15,2,FALSE),\"\")","v":""},null,"2025-12-14",46005,{"$f":"IFERROR(VLOOKUP(C18,テーブル4[],2,0),\"\")","v":""},{"$f":"IFERROR(VLOOKUP(C18,テーブル5[],2,FALSE),\"\")","v":""},{"$f":"IFERROR(VLOOKUP(C18,テーブル84[],2,FALSE),\"\")","v":""},{"$f":"IFERROR(VLOOKUP(C18,テーブル6[],2,FALSE),\"\")","v":""},{"$f":"IFERROR(VLOOKUP(C18,テーブル7[],2,FALSE),\"\")","v":""},{"$f":"IFERROR(VLOOKUP(C18,テーブル8[],2,FALSE),\"\")","v":""}]
[{"$f":"IFERROR(VLOOKUP(C19,祝日など!$A$2:$B$55,2,FALSE),\"\")&IFERROR(VLOOKUP(C19,祝日など!$D$2:$E$15,2,FALSE),\"\")","v":""},null,"2025-12-15",{"$f":"C19","v":46006},{"$f":"IFERROR(VLOOKUP(C19,テーブル4[],2,0),\"\")","v":""},{"$f":"IFERROR(VLOOKUP(C19,テーブル5[],2,FALSE),\"\")","v":""},{"$f":"IFERROR(VLOOKUP(C19,テーブル84[],2,FALSE),\"\")","v":""},{"$f":"IFERROR(VLOOKUP(C19,テーブル6[],2,FALSE),\"\")","v":""},{"$f":"IFERROR(VLOOKUP(C19,テーブル7[],2,FALSE),\"\")","v":""},{"$f":"IFERROR(VLOOKUP(C19,テーブル8[],2,FALSE),\"\")","v":""}]
[{"$f":"IFERROR(VLOOKUP(C20,祝日など!$A$2:$B$55,2,FALSE),\"\")&IFERROR(VLOOKUP(C20,祝日など!$D$2:$E$15,2,FALSE),\"\")","v":""},null,"2025-12-16",46007,{"$f":"IFERROR(VLOOKUP(C20,テーブル4[],2,0),\"\")","v":"有機宇宙地球化学セミナー\n10時～（薮田）"},{"$f":"IFERROR(VLOOKUP(C20,テーブル5[],2,FALSE),\"\")","v":"有機宇宙地球化学セミナー\n（薮田）"},{"$f":"IFERROR(VLOOKUP(C20,テーブル84[],2,FALSE),\"\")","v":""},{"$f":"IFERROR(VLOOKUP(C20,テーブル6[],2,FALSE),\"\")","v":""},{"$f":"IFERROR(VLOOKUP(C20,テーブル7[],2,FALSE),\"\")","v":""},{"$f":"IFERROR(VLOOKUP(C20,テーブル8[],2,FALSE),\"\")","v":""}]
{"$rows_left_out":16}
{"sheet":"祝日など","index":1,"n_rows":55,"n_cols":5,"rows_kept":55,"cut":false,"hidden":false,"merged":[]}
["祝日の日付","名称",null,"授業関係日付","授業関係"]
["2025-01-01","元日",null,"2025-04-08","第1ターム開始"]
["2025-01-02","休日",null,"2025-05-01","振替授業(火)"]
["2025-01-03","休日",null,"2025-05-07","振替授業(月)"]
["2025-01-13","成人の日",null,"2025-06-06","第2ターム開始"]
["2025-02-11","建国記念の日",null,"2025-07-18","振替授業(月)"]
["2025-02-23","天皇誕生日",null,"2025-08-04","夏季休暇開始"]
["2025-02-24","振替休日",null,"2025-10-02","第3ターム開始"]
["2025-03-20","春分の日",null,"2025-10-16","振替授業(月)"]
["2025-04-29","昭和の日",null,"2025-11-07","振替授業(月)"]
["2025-05-03","憲法記念日",null,"2025-12-02","第4ターム開始"]
["2025-05-04","みどりの日",null,"2025-12-25","振替授業(金)"]
["2025-05-05","こどもの日",null,"2026-01-06","振替授業(月)"]
["2025-05-06","振替休日",null,"2026-01-14","振替授業(月)"]
["2025-07-21","海の日",null,"2026-02-09","冬季休暇開始"]
["2025-08-11","山の日"]
["2025-08-12","夏季休業"]
["2025-08-13","夏季休業"]
["2025-08-14","夏季休業"]
["2025-08-15","夏季休業"]
{"$rows_left_out":36}
{"sheet":"9-10時限","index":2,"n_rows":103,"n_cols":2,"rows_kept":103,"cut":false,"hidden":false,"merged":[]}
["日付","9-10時限"]
["2025-04-08","地球外物質セミナー\n（宮原・小池）"]
["2025-04-09","LIRGセミナー\n（柴田・秋澤・DEY・平山）"]
["2025-04-10","岩石変形セミナー\n（片山・岡﨑）"]
["2025-04-15","地球外物質セミナー\n（宮原・小池）"]
["2025-04-16","LIRGセミナー\n（柴田・秋澤・DEY・平山）"]
["2025-04-17","岩石変形セミナー\n（片山・岡﨑）"]
["2025-04-22","地球外物質セミナー\n（宮原・小池）"]
["2025-04-23","LIRGセミナー\n（柴田・秋澤・DEY・平山）"]
["2025-04-24","岩石変形セミナー\n（片山・岡﨑）"]
["2025-04-28","教員会"]
["2025-04-30","LIRGセミナー\n（柴田・秋澤・DEY・平山）"]
["2025-05-01","地球外物質セミナー\n（宮原・小池）"]
["2025-05-07","LIRGセミナー\n（柴田・秋澤・DEY・平山）"]
["2025-05-08","岩石変形セミナー\n（片山・岡﨑）"]
["2025-05-13","地球外物質セミナー\n（宮原・小池）"]
["2025-05-14","LIRGセミナー\n（柴田・秋澤・DEY・平山）"]
["2025-05-15","岩石変形セミナー\n（片山・岡﨑）"]
["2025-05-19","教員会"]
["2025-05-20","地球外物質セミナー\n（宮原・小池）"]
{"$rows_left_out":84}
{"sheet":"7-8時限","index":3,"n_rows":91,"n_cols":2,"rows_kept":91,"cut":false,"hidden":false,"merged":[]}
["日付","7-8時限"]
["2025-04-07","生命・環境セミナー\n（白石）"]
["2025-04-08","地球外物質セミナー\n（宮原・小池）"]
["2025-04-09","LIRGセミナー\n（柴田・秋澤・DEY・平山）"]
["2025-04-14","生命・環境セミナー\n（白石）"]
["2025-04-15","地球外物質セミナー\n（宮原・小池）"]
["2025-04-16","LIRGセミナー\n（柴田・秋澤・DEY・平山）"]
["2025-04-21","生命・環境セミナー\n（白石）"]
["2025-04-22","地球外物質セミナー\n（宮原・小池）"]
["2025-04-23","LIRGセミナー\n（柴田・秋澤・DEY・平山）"]
["2025-04-28","生命・環境セミナー\n（白石）"]
["2025-04-30","LIRGセミナー\n（柴田・秋澤・DEY・平山）"]
["2025-05-01","地球外物質セミナー\n（宮原・小池）"]
["2025-05-07","LIRGセミナー\n（柴田・秋澤・DEY・平山）"]
["2025-05-12","生命・環境セミナー\n（白石）"]
["2025-05-13","地球外物質セミナー\n（宮原・小池）"]
["2025-05-14","LIRGセミナー\n（柴田・秋澤・DEY・平山）"]
["2025-05-19","生命・環境セミナー\n（白石）"]
["2025-05-20","地球外物質セミナー\n（宮原・小池）"]
["2025-05-21","LIRGセミナー\n（柴田・秋澤・DEY・平山）"]
{"$rows_left_out":72}
{"sheet":"5-6時限","index":4,"n_rows":44,"n_cols":2,"rows_kept":44,"cut":false,"hidden":false,"merged":[]}
["日付","5-6時限"]
["2025-04-07","生命・環境セミナー\n（白石）"]
["2025-04-14","生命・環境セミナー\n（白石）"]
["2025-04-21","生命・環境セミナー\n（白石）"]
["2025-04-28","生命・環境セミナー\n（白石）"]
["2025-05-12","生命・環境セミナー\n（白石）"]
["2025-05-19","生命・環境セミナー\n（白石）"]
["2025-05-26","生命・環境セミナー\n（白石）"]
["2025-06-02","生命・環境セミナー\n（白石）"]
["2025-06-09","生命・環境セミナー\n（白石）"]
["2025-06-16","生命・環境セミナー\n（白石）"]
["2025-06-23","生命・環境セミナー\n（白石）"]
["2025-06-30","生命・環境セミナー\n（白石）"]
["2025-07-07","生命・環境セミナー\n（白石）"]
["2025-07-11","鈴村セミナー（秋澤）"]
["2025-07-14","生命・環境セミナー\n（白石）"]
["2025-07-18","生命・環境セミナー\n（白石）"]
["2025-08-26","D論審査（口述試験）"]
["2025-08-31","全学停電（8：30～18：00）"]
["2025-09-01","岡﨑セミナー"]
{"$rows_left_out":25}
{"sheet":"昼休憩","index":5,"n_rows":9,"n_cols":2,"rows_kept":9,"cut":false,"hidden":false,"merged":[]}
["日付","昼休憩"]
["2025-08-31","停電"]
["2025-09-03","須田"]
["2025-09-16","須田"]
["2025-09-26","須田"]
["2025-12-20","停電"]
["2025-12-21","停電"]
["2026-02-12","D入試"]
["2026-02-13","懇談会"]

{"sheet":"3-4時限","index":6,"n_rows":78,"n_cols":2,"rows_kept":78,"cut":false,"hidden":false,"merged":[]}
["日付","3-4時限"]
["2025-04-08","有機宇宙地球化学セミナー\n（薮田）"]
["2025-04-10","内物セミナー\n（須田・中久喜）"]
["2025-04-15","有機宇宙地球化学セミナー\n（薮田）"]
["2025-04-17","内物セミナー\n（須田・中久喜）"]
["2025-04-22","有機宇宙地球化学セミナー\n（薮田）"]
["2025-04-24","内物セミナー\n（須田・中久喜）"]
["2025-05-01","有機宇宙地球化学セミナー\n（薮田）"]
["2025-05-08","内物セミナー\n（須田・中久喜）"]
["2025-05-13","有機宇宙地球化学セミナー\n（薮田）"]
["2025-05-15","内物セミナー\n（須田・中久喜）"]
["2025-05-20","有機宇宙地球化学セミナー\n（薮田）"]
["2025-05-22","内物セミナー\n（須田・中久喜）"]
["2025-05-27","有機宇宙地球化学セミナー\n（薮田）"]
["2025-05-29","内物セミナー\n（須田・中久喜）"]
["2025-06-03","有機宇宙地球化学セミナー\n（薮田）"]
["2025-06-05","内物セミナー\n（須田・中久喜）"]
["2025-06-10","有機宇宙地球化学セミナー\n（薮田）"]
["2025-06-12","内物セミナー\n（須田・中久喜）"]
["2025-06-17","有機宇宙地球化学セミナー\n（薮田）"]
{"$rows_left_out":59}
{"sheet":"1-2時限","index":7,"n_rows":77,"n_cols":2,"rows_kept":77,"cut":false,"hidden":false,"merged":[]}
["日付","1-2時限"]
["2025-04-08","有機宇宙地球化学セミナー\n10時～（薮田）"]
["2025-04-10","PRDセミナー\n（安東・DAS）"]
["2025-04-15","有機宇宙地球化学セミナー\n10時～（薮田）"]
["2025-04-17","PRDセミナー\n（安東・DAS）"]
["2025-04-22","有機宇宙地球化学セミナー\n10時～（薮田）"]
["2025-04-24","PRDセミナー\n（安東・DAS）"]
["2025-05-01","有機宇宙地球化学セミナー\n10時～（薮田）"]
["2025-05-08","PRDセミナー\n（安東・DAS）"]
["2025-05-13","有機宇宙地球化学セミナー\n10時～（薮田）"]
["2025-05-15","PRDセミナー\n（安東・DAS）"]
["2025-05-20","有機宇宙地球化学セミナー\n10時～（薮田）"]
["2025-05-22","PRDセミナー\n（安東・DAS）"]
["2025-05-27","有機宇宙地球化学セミナー\n10時～（薮田）"]
["2025-05-29","PRDセミナー\n（安東・DAS）"]
["2025-06-03","有機宇宙地球化学セミナー\n10時～（薮田）"]
["2025-06-05","PRDセミナー\n（安東・DAS）"]
["2025-06-10","有機宇宙地球化学セミナー\n10時～（薮田）"]
["2025-06-12","PRDセミナー\n（安東・DAS）"]
["2025-06-17","有機宇宙地球化学セミナー\n10時～（薮田）"]
{"$rows_left_out":58}
{"sheet":"セミナー","index":8,"n_rows":366,"n_cols":9,"rows_kept":366,"cut":false,"hidden":false,"merged":[]}
["日付","曜日","祝日など","1-2時限","3-4時限","昼休憩","5-6時限","7-8時限","9-10時限"]
["2025-04-01","(火)",{"$f":"IFERROR(VLOOKUP(A2,テーブル1[],2,FALSE),\"\")&IFERROR(VLOOKUP(A2,祝日など!$D$2:$E$15,2,FALSE),\"\")","v":""}]
["2025-04-02","(水)",{"$f":"IFERROR(VLOOKUP(A3,テーブル1[],2,FALSE),\"\")&IFERROR(VLOOKUP(A3,祝日など!$D$2:$E$15,2,FALSE),\"\")","v":""}]
["2025-04-03","(木)",{"$f":"IFERROR(VLOOKUP(A4,テーブル1[],2,FALSE),\"\")&IFERROR(VLOOKUP(A4,祝日など!$D$2:$E$15,2,FALSE),\"\")","v":""}]
["2025-04-04","(金)",{"$f":"IFERROR(VLOOKUP(A5,テーブル1[],2,FALSE),\"\")&IFERROR(VLOOKUP(A5,祝日など!$D$2:$E$15,2,FALSE),\"\")","v":""}]
["2025-04-05","(土)",{"$f":"IFERROR(VLOOKUP(A6,テーブル1[],2,FALSE),\"\")&IFERROR(VLOOKUP(A6,祝日など!$D$2:$E$15,2,FALSE),\"\")","v":""}]
["2025-04-06","(日)",{"$f":"IFERROR(VLOOKUP(A7,テーブル1[],2,FALSE),\"\")&IFERROR(VLOOKUP(A7,祝日など!$D$2:$E$15,2,FALSE),\"\")","v":""}]
["2025-04-07","(月)",{"$f":"IFERROR(VLOOKUP(A8,テーブル1[],2,FALSE),\"\")&IFERROR(VLOOKUP(A8,祝日など!$D$2:$E$15,2,FALSE),\"\")","v":""},null,null,null,"生命・環境セミナー\n（白石）","生命・環境セミナー\n（白石）"]
["2025-04-08","(火)",{"$f":"IFERROR(VLOOKUP(A9,テーブル1[],2,FALSE),\"\")&IFERROR(VLOOKUP(A9,祝日など!$D$2:$E$15,2,FALSE),\"\")","v":"第1ターム開始"},"有機宇宙地球化学セミナー\n10時～（薮田）","有機宇宙地球化学セミナー\n（薮田）",null,null,"地球外物質セミナー\n（宮原・小池）","地球外物質セミナー\n（宮原・小池）"]
["2025-04-09","(水)",{"$f":"IFERROR(VLOOKUP(A10,テーブル1[],2,FALSE),\"\")&IFERROR(VLOOKUP(A10,祝日など!$D$2:$E$15,2,FALSE),\"\")","v":""},null,null,null,null,"LIRGセミナー\n（柴田・秋澤・DEY・平山）","LIRGセミナー\n（柴田・秋澤・DEY・平山）"]
["2025-04-10","(木)",{"$f":"IFERROR(VLOOKUP(A11,テーブル1[],2,FALSE),\"\")&IFERROR(VLOOKUP(A11,祝日など!$D$2:$E$15,2,FALSE),\"\")","v":""},"PRDセミナー\n（安東・DAS）","内物セミナー\n（須田・中久喜）",null,null,null,"岩石変形セミナー\n（片山・岡﨑）"]
["2025-04-11","(金)",{"$f":"IFERROR(VLOOKUP(A12,テーブル1[],2,FALSE),\"\")&IFERROR(VLOOKUP(A12,祝日など!$D$2:$E$15,2,FALSE),\"\")","v":""}]
["2025-04-12","(土)",{"$f":"IFERROR(VLOOKUP(A13,テーブル1[],2,FALSE),\"\")&IFERROR(VLOOKUP(A13,祝日など!$D$2:$E$15,2,FALSE),\"\")","v":""}]
["2025-04-13","(日)",{"$f":"IFERROR(VLOOKUP(A14,テーブル1[],2,FALSE),\"\")&IFERROR(VLOOKUP(A14,祝日など!$D$2:$E$15,2,FALSE),\"\")","v":""}]
["2025-04-14","(月)",{"$f":"IFERROR(VLOOKUP(A15,テーブル1[],2,FALSE),\"\")&IFERROR(VLOOKUP(A15,祝日など!$D$2:$E$15,2,FALSE),\"\")","v":""},null,null,null,"生命・環境セミナー\n（白石）","生命・環境セミナー\n（白石）"]
["2025-04-15","(火)",{"$f":"IFERROR(VLOOKUP(A16,テーブル1[],2,FALSE),\"\")&IFERROR(VLOOKUP(A16,祝日など!$D$2:$E$15,2,FALSE),\"\")","v":""},"有機宇宙地球化学セミナー\n10時～（薮田）","有機宇宙地球化学セミナー\n（薮田）",null,null,"地球外物質セミナー\n（宮原・小池）","地球外物質セミナー\n（宮原・小池）"]
["2025-04-16","(水)",{"$f":"IFERROR(VLOOKUP(A17,テーブル1[],2,FALSE),\"\")&IFERROR(VLOOKUP(A17,祝日など!$D$2:$E$15,2,FALSE),\"\")","v":""},null,null,null,null,"LIRGセミナー\n（柴田・秋澤・DEY・平山）","LIRGセミナー\n（柴田・秋澤・DEY・平山）"]
["2025-04-17","(木)",{"$f":"IFERROR(VLOOKUP(A18,テーブル1[],2,FALSE),\"\")&IFERROR(VLOOKUP(A18,祝日など!$D$2:$E$15,2,FALSE),\"\")","v":""},"PRDセミナー\n（安東・DAS）","内物セミナー\n（須田・中久喜）",null,null,null,"岩石変形セミナー\n（片山・岡﨑）"]
["2025-04-18","(金)",{"$f":"IFERROR(VLOOKUP(A19,テーブル1[],2,FALSE),\"\")&IFERROR(VLOOKUP(A19,祝日など!$D$2:$E$15,2,FALSE),\"\")","v":""}]
["2025-04-19","(土)",{"$f":"IFERROR(VLOOKUP(A20,テーブル1[],2,FALSE),\"\")&IFERROR(VLOOKUP(A20,祝日など!$D$2:$E$15,2,FALSE),\"\")","v":""}]
{"$rows_left_out":346}