{"text_format":"1","workbook":"xlsx","n_sheets":9,"sheets":["カレンダー (A601-4)","祝日など","9-10時限","7-8時限","5-6時限","昼休憩","3-4時限","1-2時限","セミナー"],"not_rendered":{"charts":0,"images":0,"macros":1,"external_links":1,"defined_names":0,"comments":0,"pivot_tables":0},"unopened":[],"bounds":{"document_bytes":16777216,"sheet_cells":100000,"rows_first":2000,"rows_last":500,"rows_between":2000,"halvings":0,"cell_chars":16384,"cell_head_chars":4096},"cells_cut":0,"cells_raw":0,"read":"whole","date_system":"1900"}

{"sheet":"カレンダー (A601-4)","index":0,"n_rows":35,"n_cols":10,"rows_kept":35,"cut":false,"hidden":false,"merged":[[12,0,12,1],[0,4,0,9],[1,4,1,8],[2,6,3,6],[4,0,4,1],[5,0,5,1],[6,0,6,1],[7,0,7,1],[8,0,8,1],[9,0,9,1],[10,0,10,1],[11,0,11,1],[24,0,24,1],[13,0,13,1],[14,0,14,1],[15,0,15,1],[16,0,16,1],[17,0,17,1],[18,0,18,1],[19,0,19,1],[20,0,20,1],[21,0,21,1],[22,0,22,1],[23,0,23,1],[31,0,31,1],[32,0,32,1],[33,0,33,1],[34,0,34,1],[25,0,25,1],[26,0,26,1],[27,0,27,1],[28,0,28,1],[29,0,29,1],[30,0,30,1]]}
[{"$f":"B2","v":"2025-12-01"},null,"年",null,"A601-4号室（第1セミナー室）"]
[null,"2025-12-01","月",null,"※予定を入れる/変更する場合は，地事務までご連絡ください。",null,null,null,null,"（収容人数：24名）"]
[null,null,"時限",null,"１・２","３・４","昼休憩","５・６","７・８","９・１０"]
[null,null,"日","曜日","08:45-10:15","10:30-12:00",null,"12:50-14:20","14:35-16:05","16:20-17:50"]
[{"$f":"IFERROR(VLOOKUP(C5,祝日など!$A$2:$B$55,2,FALSE),\"\")&IFERROR(VLOOKUP(C5,祝日など!$D$2:$E$15,2,FALSE),\"\")","v":""},null,{"$f":"B2","v":"2025-12-01"},{"$f":"C5","v":45992},{"$f":"IFERROR(VLOOKUP(C5,テーブル4[],2,0),\"\")","v":""},{"$f":"IFERROR(VLOOKUP(C5,テーブル5[],2,FALSE),\"\")","v":""},{"$f":"IFERROR(VLOOKUP(C5,テーブル84[],2,FALSE),\"\")","v":""},{"$f":"IFERROR(VLOOKUP(C5,テーブル6[],2,FALSE),\"\")","v":""},{"$f":"IFERROR(VLOOKUP(C5,テーブル7[],2,FALSE),\"\")","v":""},{"$f":"IFERROR(VLOOKUP(C5,テーブル8[],2,FALSE),\"\")","v":""}]
[{"$f":"IFERROR(VLOOKUP(C6,祝日など!$A$2:$B$55,2,FALSE),\"\")&IFERROR(VLOOKUP(C6,祝日など!$D$2:$E$15,2,FALSE),\"\")","v":"第4ターム開始"},null,{"$f":"C5+1","v":"2025-12-02"},{"$f":"C6","v":45993},{"$f":"IFERROR(VLOOKUP(C6,テーブル4[],2,0),\"\")","v":"有機宇宙地球化学セミナー\n10時～（薮田）"},{"$f":"IFERROR(VLOOKUP(C6,テーブル5[],2,FALSE),\"\")","v":"有機宇宙地球化学セミナー\n（薮田）"},{"$f":"IFERROR(VLOOKUP(C6,テーブル84[],2,FALSE),\"\")","v":""},{"$f":"IFERROR(VLOOKUP(C6,テーブル6[],2,FALSE),\"\")","v":""},{"$f":"IFERROR(VLOOKUP(C6,テーブル7[],2,FALSE),\"\")","v":""},{"$f":"IFERROR(VLOOKUP(C6,テーブル8[],2,FALSE),\"\")","v":""}]
[{"$f":"IFERROR(VLOOKUP(C7,祝日など!$A$2:$B$55,2,FALSE),\"\")&IFERROR(VLOOKUP(C7,祝日など!$D$2:$E$15,2,FALSE),\"\")","v":""},null,{"$f":"C6+1","v":"2025-12-03"},45994,{"$f":"IFERROR(VLOOKUP(C7,テーブル4[],2,0),\"\")","v":""},{"$f":"IFERROR(VLOOKUP(C7,テーブル5[],2,FALSE),\"\")","v":""},{"$f":"IFERROR(VLOOKUP(C7,テーブル84[],2,FALSE),\"\")","v":""},{"$f":"IFERROR(VLOOKUP(C7,テーブル6[],2,FALSE),\"\")","v":""},{"$f":"IFERROR(VLOOKUP(C7,テーブル7[],2,FALSE),\"\")","v":"LIRGセミナー\n（柴田・秋澤・平山）"},{"$f":"IFERROR(VLOOKUP(C7,テーブル8[],2,FALSE),\"\")","v":"LIRGセミナー\n（柴田・秋澤・平山）"}]
[{"$f":"IFERROR(VLOOKUP(C8,祝日など!$A$2:$B$55,2,FALSE),\"\")&IFERROR(VLOOKUP(C8,祝日など!$D$2:$E$15,2,FALSE),\"\")","v":""},null,"2025-12-04",45995,{"$f":"IFERROR(VLOOKUP(C8,テーブル4[],2,0),\"\")","v":""},{"$f":"IFERROR(VLOOKUP(C8,テーブル5[],2,FALSE),\"\")","v":""},{"$f":"IFERROR(VLOOKUP(C8,テーブル84[],2,FALSE),\"\")","v":""},{"$f":"IFERROR(VLOOKUP(C8,テーブル6[],2,FALSE),\"\")","v":""},{"$f":"IFERROR(VLOOKUP(C8,テーブル7[],2,FALSE),\"\")","v":"内物セミナー\n（須田・中久喜）"},{"$f":"IFERROR(VLOOKUP(C8,テーブル8[],2,FALSE),\"\")","v":"岩石変形セミナー\n（片山・岡﨑）"}]
[{"$f":"IFERROR(VLOOKUP(C9,祝日など!$A$2:$B$55,2,FALSE),\"\")&IFERROR(VLOOKUP(C9,祝日など!$D$2:$E$15,2,FALSE),\"\")","v":""},null,"2025-12-05",45996,{"$f":"IFERROR(VLOOKUP(C9,テーブル4[],2,0),\"\")","v":"生命・環境セミナー\n（白石）"},{"$f":"IFERROR(VLOOKUP(C9,テーブル5[],2,FALSE),\"\")","v":"生命・環境セミナー\n（白石）"},{"$f":"IFERROR(VLOOKUP(C9,テーブル84[],2,FALSE),\"\")","v":""},{"$f":"IFERROR(VLOOKUP(C9,テーブル6[],2,FALSE),\"\")","v":"地球外物質セミナー\n（宮原・小池）"},{"$f":"IFERROR(VLOOKUP(C9,テーブル7[],2,FALSE),\"\")","v":""},{"$f":"IFERROR(VLOOKUP(C9,テーブル8[],2,FALSE),\"\")","v":""}]
[{"$f":"IFERROR(VLOOKUP(C10,祝日など!$A$2:$B$55,2,FALSE),\"\")&IFERROR(VLOOKUP(C10,祝日など!$D$2:$E$15,2,FALSE),\"\")","v":""},null,"2025-12-06",45997,{"$f":"IFERROR(VLOOKUP(C10,テーブル4[],2,0),\"\")","v":""},{"$f":"IFERROR(VLOOKUP(C10,テーブル5[],2,FALSE),\"\")","v":""},{"$f":"IFERROR(VLOOKUP(C10,テーブル84[],2,FALSE),\"\")","v":""},{"$f":"IFERROR(VLOOKUP(C10,テーブル6[],2,FALSE),\"\")","v":""},{"$f":"IFERROR(VLOOKUP(C10,テーブル7[],2,FALSE),\"\")","v":""},{"$f":"IFERROR(VLOOKUP(C10,テーブル8[],2,FALSE),\"\")","v":""}]
[{"$f":"IFERROR(VLOOKUP(C11,祝日など!$A$2:$B$55,2,FALSE),\"\")&IFERROR(VLOOKUP(C11,祝日など!$D$2:$E$15,2,FALSE),\"\")","v":""},null,"2025-12-07",45998,{"$f":"IFERROR(VLOOKUP(C11,テーブル4[],2,0),\"\")","v":""},{"$f":"IFERROR(VLOOKUP(C11,テーブル5[],2,FALSE),\"\")","v":""},{"$f":"IFERROR(VLOOKUP(C11,テーブル84[],2,FALSE),\"\")","v":""},{"$f":"IFERROR(VLOOKUP(C11,テーブル6[],2,FALSE),\"\")","v":""},{"$f":"IFERROR(VLOOKUP(C11,テーブル7[],2,FALSE),\"\")","v":""},{"$f":"IFERROR(VLOOKUP(C11,テーブル8[],2,FALSE),\"\")","v":""}]
[{"$f":"IFERROR(VLOOKUP(C12,祝日など!$A$2:$B$55,2,FALSE),\"\")&IFERROR(VLOOKUP(C12,祝日など!$D$2:$E$15,2,FALSE),\"\")","v":""},null,"2025-12-08",45999,{"$f":"IFERROR(VLOOKUP(C12,テーブル4[],2,0),\"\")","v":""},{"$f":"IFERROR(VLOOKUP(C12,テーブル5[],2,FALSE),\"\")","v":""},{"$f":"IFERROR(VLOOKUP(C12,テーブル84[],2,FALSE),\"\")","v":""},{"$f":"IFERROR(VLOOKUP(C12,テーブル6[],2,FALSE),\"\")","v":""},{"$f":"IFERROR(VLOOKUP(C12,テーブル7[],2,FALSE),\"\")","v":""},{"$f":"IFERROR(VLOOKUP(C12,テーブル8[],2,FALSE),\"\")","v":""}]
[{"$f":"IFERROR(VLOOKUP(C13,祝日など!$A$2:$B$55,2,FALSE),\"\")&IFERROR(VLOOKUP(C13,祝日など!$D$2:$E$15,2,FALSE),\"\")","v":""},null,"2025-12-09",46000,{"$f":"IFERROR(VLOOKUP(C13,テーブル4[],2,0),\"\")","v":"有機宇宙地球化学セミナー\n10時～（薮田）"},{"$f":"IFERROR(VLOOKUP(C13,テーブル5[],2,FALSE),\"\")","v":"有機宇宙地球化学セミナー\n（薮田）"},{"$f":"IFERROR(VLOOKUP(C13,テーブル84[],2,FALSE),\"\")","v":""},{"$f":"IFERROR(VLOOKUP(C13,テーブル6[],2,FALSE),\"\")","v":""},{"$f":"IFERROR(VLOOKUP(C13,テーブル7[],2,FALSE),\"\")","v":""},{"$f":"IFERROR(VLOOKUP(C13,テーブル8[],2,FALSE),\"\")","v":""}]
[{"$f":"IFERROR(VLOOKUP(C14,祝日など!$A$2:$B$55,2,FALSE),\"\")&IFERROR(VLOOKUP(C14,祝日など!$D$2:$E$15,2,FALSE),\"\")","v":""},null,"2025-12-10",46001,{"$f":"IFERROR(VLOOKUP(C14,テーブル4[],2,0),\"\")","v":""},{"$f":"IFERROR(VLOOKUP(C14,テーブル5[],2,FALSE),\"\")","v":""},{"$f":"IFERROR(VLOOKUP(C14,テーブル84[],2,FALSE),\"\")","v":""},{"$f":"IFERROR(VLOOKUP(C14,テーブル6[],2,FALSE),\"\")","v":""},{"$f":"IFERROR(VLOOKUP(C14,テーブル7[],2,FALSE),\"\")","v":"LIRGセミナー\n（柴田・秋澤・平山）"},{"$f":"IFERROR(VLOOKUP(C14,テーブル8[],2,FALSE),\"\")","v":"LIRGセミナー\n（柴田・秋澤・平山）"}]
[{"$f":"IFERROR(VLOOKUP(C15,祝日など!$A$2:$B$55,2,FALSE),\"\")&IFERROR(VLOOKUP(C15,祝日など!$D$2:$E$15,2,FALSE),\"\")","v":""},null,"2025-12-11",46002,{"$f":"IFERROR(VLOOKUP(C15,テーブル4[],2,0),\"\")","v":""},{"$f":"IFERROR(VLOOKUP(C15,テーブル5[],2,FALSE),\"\")","v":""},{"$f":"IFERROR(VLOOKUP(C15,テーブル84[],2,FALSE),\"\")","v":""},{"$f":"IFERROR(VLOOKUP(C15,テーブル6[],2,FALSE),\"\")","v":""},{"$f":"IFERROR(VLOOKUP(C15,テーブル7[],2,FALSE),\"\")","v":"内物セミナー\n（須田・中久喜）"},{"$f":"IFERROR(VLOOKUP(C15,テーブル8[],2,FALSE),\"\")","v":"岩石変形セミナー\n（片山・岡﨑）"}]
[{"$f":"IFERROR(VLOOKUP(C16,祝日など!$A$2:$B$55,2,FALSE),\"\")&IFERROR(VLOOKUP(C16,祝日など!$D$2:$E$15,2,FALSE),\"\")","v":""},null,"2025-12-12",46003,{"$f":"IFERROR(VLOOKUP(C16,テーブル4[],2,0),\"\")","v":"生命・環境セミナー\n（白石）"},{"$f":"IFERROR(VLOOKUP(C16,テーブル5[],2,FALSE),\"\")","v":"生命・環境セミナー\n（白石）"},{"$f":"IFERROR(VLOOKUP(C16,テーブル84[],2,FALSE),\"\")","v":""},{"$f":"IFERROR(VLOOKUP(C16,テーブル6[],2,FALSE),\"\")","v":"地球外物質セミナー\n（宮原・小池）"},{"$f":"IFERROR(VLOOKUP(C16,テーブル7[],2,FALSE),\"\")","v":"㈱コベルコ科研 会社説明会"},{"$f":"IFERROR(VLOOKUP(C16,テーブル8[],2,FALSE),\"\")","v":""}]
[{"$f":"IFERROR(VLOOKUP(C17,祝日など!$A$2:$B$55,2,FALSE),\"\")&IFERROR(VLOOKUP(C17,祝日など!$D$2:$E$15,2,FALSE),\"\")","v":""},null,"2025-12-13",46004,{"$f":"IFERROR(VLOOKUP(C17,テーブル4[],2,0),\"\")","v":""},{"$f":"IFERROR(VLOOKUP(C17,テーブル5[],2,FALSE),\"\")","v":""},{"$f":"IFERROR(VLOOKUP(C17,テーブル84[],2,FALSE),\"\")","v":""},{"$f":"IFERROR(VLOOKUP(C17,テーブル6[],2,FALSE),\"\")","v":""},{"$f":"IFERROR(VLOOKUP(C17,テーブル7[],2,FALSE),\"\")","v":""},{"$f":"IFERROR(VLOOKUP(C17,テーブル8[],2,FALSE),\"\")","v":""}]
[{"$f":"IFERROR(VLOOKUP(C18,祝日など!$A$2:$B$55,2,FALSE),\"\")&IFERROR(VLOOKUP(C18,祝日など!$D$2:$E$15,2,FALSE),\"\")","v":""},null,"2025-12-14",46005,{"$f":"IFERROR(VLOOKUP(C18,テーブル4[],2,0),\"\")","v":""},{"$f":"IFERROR(VLOOKUP(C18,テーブル5[],2,FALSE),\"\")","v":""},{"$f":"IFERROR(VLOOKUP(C18,テーブル84[],2,FALSE),\"\")","v":""},{"$f":"IFERROR(VLOOKUP(C18,テーブル6[],2,FALSE),\"\")","v":""},{"$f":"IFERROR(VLOOKUP(C18,テーブル7[],2,FALSE),\"\")","v":""},{"$f":"IFERROR(VLOOKUP(C18,テーブル8[],2,FALSE),\"\")","v":""}]
[{"$f":"IFERROR(VLOOKUP(C19,祝日など!$A$2:$B$55,2,FALSE),\"\")&IFERROR(VLOOKUP(C19,祝日など!$D$2:$E$15,2,FALSE),\"\")","v":""},null,"2025-12-15",{"$f":"C19","v":46006},{"$f":"IFERROR(VLOOKUP(C19,テーブル4[],2,0),\"\")","v":""},{"$f":"IFERROR(VLOOKUP(C19,テーブル5[],2,FALSE),\"\")","v":""},{"$f":"IFERROR(VLOOKUP(C19,テーブル84[],2,FALSE),\"\")","v":""},{"$f":"IFERROR(VLOOKUP(C19,テーブル6[],2,FALSE),\"\")","v":""},{"$f":"IFERROR(VLOOKUP(C19,テーブル7[],2,FALSE),\"\")","v":""},{"$f":"IFERROR(VLOOKUP(C19,テーブル8[],2,FALSE),\"\")","v":""}]
[{"$f":"IFERROR(VLOOKUP(C20,祝日など!$A$2:$B$55,2,FALSE),\"\")&IFERROR(VLOOKUP(C20,祝日など!$D$2:$E$15,2,FALSE),\"\")","v":""},null,"2025-12-16",46007,{"$f":"IFERROR(VLOOKUP(C20,テーブル4[],2,0),\"\")","v":"有機宇宙地球化学セミナー\n10時～（薮田）"},{"$f":"IFERROR(VLOOKUP(C20,テーブル5[],2,FALSE),\"\")","v":"有機宇宙地球化学セミナー\n（薮田）"},{"$f":"IFERROR(VLOOKUP(C20,テーブル84[],2,FALSE),\"\")","v":""},{"$f":"IFERROR(VLOOKUP(C20,テーブル6[],2,FALSE),\"\")","v":""},{"$f":"IFERROR(VLOOKUP(C20,テーブル7[],2,FALSE),\"\")","v":""},{"$f":"IFERROR(VLOOKUP(C20,テーブル8[],2,FALSE),\"\")","v":""}]
[{"$f":"IFERROR(VLOOKUP(C21,祝日など!$A$2:$B$55,2,FALSE),\"\")&IFERROR(VLOOKUP(C21,祝日など!$D$2:$E$15,2,FALSE),\"\")","v":""},null,"2025-12-17",46008,{"$f":"IFERROR(VLOOKUP(C21,テーブル4[],2,0),\"\")","v":""},{"$f":"IFERROR(VLOOKUP(C21,テーブル5[],2,FALSE),\"\")","v":""},{"$f":"IFERROR(VLOOKUP(C21,テーブル84[],2,FALSE),\"\")","v":""},{"$f":"IFERROR(VLOOKUP(C21,テーブル6[],2,FALSE),\"\")","v":""},{"$f":"IFERROR(VLOOKUP(C21,テーブル7[],2,FALSE),\"\")","v":"LIRGセミナー\n（柴田・秋澤・平山）"},{"$f":"IFERROR(VLOOKUP(C21,テーブル8[],2,FALSE),\"\")","v":"LIRGセミナー\n（柴田・秋澤・平山）"}]
[{"$f":"IFERROR(VLOOKUP(C22,祝日など!$A$2:$B$55,2,FALSE),\"\")&IFERROR(VLOOKUP(C22,祝日など!$D$2:$E$15,2,FALSE),\"\")","v":""},null,"2025-12-18",46009,{"$f":"IFERROR(VLOOKUP(C22,テーブル4[],2,0),\"\")","v":""},{"$f":"IFERROR(VLOOKUP(C22,テーブル5[],2,FALSE),\"\")","v":""},{"$f":"IFERROR(VLOOKUP(C22,テーブル84[],2,FALSE),\"\")","v":""},{"$f":"IFERROR(VLOOKUP(C22,テーブル6[],2,FALSE),\"\")","v":""},{"$f":"IFERROR(VLOOKUP(C22,テーブル7[],2,FALSE),\"\")","v":"内物セミナー\n（須田・中久喜）"},{"$f":"IFERROR(VLOOKUP(C22,テーブル8[],2,FALSE),\"\")","v":"岩石変形セミナー\n（片山・岡﨑）"}]
[{"$f":"IFERROR(VLOOKUP(C23,祝日など!$A$2:$B$55,2,FALSE),\"\")&IFERROR(VLOOKUP(C23,祝日など!$D$2:$E$15,2,FALSE),\"\")","v":""},null,"2025-12-19",46010,{"$f":"IFERROR(VLOOKUP(C23,テーブル4[],2,0),\"\")","v":""},{"$f":"IFERROR(VLOOKUP(C23,テーブル5[],2,FALSE),\"\")","v":""},{"$f":"IFERROR(VLOOKUP(C23,テーブル84[],2,FALSE),\"\")","v":""},{"$f":"IFERROR(VLOOKUP(C23,テーブル6[],2,FALSE),\"\")","v":"地球外物質セミナー\n（宮原・小池）"},{"$f":"IFERROR(VLOOKUP(C23,テーブル7[],2,FALSE),\"\")","v":""},{"$f":"IFERROR(VLOOKUP(C23,テーブル8[],2,FALSE),\"\")","v":""}]
[{"$f":"IFERROR(VLOOKUP(C24,祝日など!$A$2:$B$55,2,FALSE),\"\")&IFERROR(VLOOKUP(C24,祝日など!$D$2:$E$15,2,FALSE),\"\")","v":""},null,"2025-12-20",46011,{"$f":"IFERROR(VLOOKUP(C24,テーブル4[],2,0),\"\")","v":"改修用停電"},{"$f":"IFERROR(VLOOKUP(C24,テーブル5[],2,FALSE),\"\")","v":"改修用停電"},{"$f":"IFERROR(VLOOKUP(C24,テーブル84[],2,FALSE),\"\")","v":"停電"},{"$f":"IFERROR(VLOOKUP(C24,テーブル6[],2,FALSE),\"\")","v":"改修用停電"},{"$f":"IFERROR(VLOOKUP(C24,テーブル7[],2,FALSE),\"\")","v":"改修用停電"},{"$f":"IFERROR(VLOOKUP(C24,テーブル8[],2,FALSE),\"\")","v":"改修用停電"}]
[{"$f":"IFERROR(VLOOKUP(C25,祝日など!$A$2:$B$55,2,FALSE),\"\")&IFERROR(VLOOKUP(C25,祝日など!$D$2:$E$15,2,FALSE),\"\")","v":""},null,"2025-12-21",46012,{"$f":"IFERROR(VLOOKUP(C25,テーブル4[],2,0),\"\")","v":"改修用停電"},{"$f":"IFERROR(VLOOKUP(C25,テーブル5[],2,FALSE),\"\")","v":"改修用停電"},{"$f":"IFERROR(VLOOKUP(C25,テーブル84[],2,FALSE),\"\")","v":"停電"},{"$f":"IFERROR(VLOOKUP(C25,テーブル6[],2,FALSE),\"\")","v":"改修用停電"},{"$f":"IFERROR(VLOOKUP(C25,テーブル7[],2,FALSE),\"\")","v":"改修用停電"},{"$f":"IFERROR(VLOOKUP(C25,テーブル8[],2,FALSE),\"\")","v":"改修用停電"}]
[{"$f":"IFERROR(VLOOKUP(C26,祝日など!$A$2:$B$55,2,FALSE),\"\")&IFERROR(VLOOKUP(C26,祝日など!$D$2:$E$15,2,FALSE),\"\")","v":""},null,"2025-12-22",46013,{"$f":"IFERROR(VLOOKUP(C26,テーブル4[],2,0),\"\")","v":""},{"$f":"IFERROR(VLOOKUP(C26,テーブル5[],2,FALSE),\"\")","v":""},{"$f":"IFERROR(VLOOKUP(C26,テーブル84[],2,FALSE),\"\")","v":""},{"$f":"IFERROR(VLOOKUP(C26,テーブル6[],2,FALSE),\"\")","v":""},{"$f":"IFERROR(VLOOKUP(C26,テーブル7[],2,FALSE),\"\")","v":""},{"$f":"IFERROR(VLOOKUP(C26,テーブル8[],2,FALSE),\"\")","v":"教員会"}]
[{"$f":"IFERROR(VLOOKUP(C27,祝日など!$A$2:$B$55,2,FALSE),\"\")&IFERROR(VLOOKUP(C27,祝日など!$D$2:$E$15,2,FALSE),\"\")","v":""},null,"2025-12-23",46014,{"$f":"IFERROR(VLOOKUP(C27,テーブル4[],2,0),\"\")","v":"有機宇宙地球化学セミナー\n10時～（薮田）"},{"$f":"IFERROR(VLOOKUP(C27,テーブル5[],2,FALSE),\"\")","v":"有機宇宙地球化学セミナー\n（薮田）"},{"$f":"IFERROR(VLOOKUP(C27,テーブル84[],2,FALSE),\"\")","v":""},{"$f":"IFERROR(VLOOKUP(C27,テーブル6[],2,FALSE),\"\")","v":""},{"$f":"IFERROR(VLOOKUP(C27,テーブル7[],2,FALSE),\"\")","v":""},{"$f":"IFERROR(VLOOKUP(C27,テーブル8[],2,FALSE),\"\")","v":""}]
[{"$f":"IFERROR(VLOOKUP(C28,祝日など!$A$2:$B$55,2,FALSE),\"\")&IFERROR(VLOOKUP(C28,祝日など!$D$2:$E$15,2,FALSE),\"\")","v":""},null,"2025-12-24",46015,{"$f":"IFERROR(VLOOKUP(C28,テーブル4[],2,0),\"\")","v":""},{"$f":"IFERROR(VLOOKUP(C28,テーブル5[],2,FALSE),\"\")","v":""},{"$f":"IFERROR(VLOOKUP(C28,テーブル84[],2,FALSE),\"\")","v":""},{"$f":"IFERROR(VLOOKUP(C28,テーブル6[],2,FALSE),\"\")","v":""},{"$f":"IFERROR(VLOOKUP(C28,テーブル7[],2,FALSE),\"\")","v":"LIRGセミナー\n（柴田・秋澤・平山）"},{"$f":"IFERROR(VLOOKUP(C28,テーブル8[],2,FALSE),\"\")","v":"LIRGセミナー\n（柴田・秋澤・平山）"}]
[{"$f":"IFERROR(VLOOKUP(C29,祝日など!$A$2:$B$55,2,FALSE),\"\")&IFERROR(VLOOKUP(C29,祝日など!$D$2:$E$15,2,FALSE),\"\")","v":"振替授業(金)"},null,"2025-12-25",46016,{"$f":"IFERROR(VLOOKUP(C29,テーブル4[],2,0),\"\")","v":"生命・環境セミナー\n（白石）"},{"$f":"IFERROR(VLOOKUP(C29,テーブル5[],2,FALSE),\"\")","v":"生命・環境セミナー\n（白石）"},{"$f":"IFERROR(VLOOKUP(C29,テーブル84[],2,FALSE),\"\")","v":""},{"$f":"IFERROR(VLOOKUP(C29,テーブル6[],2,FALSE),\"\")","v":"地球外物質セミナー\n（宮原・小池）"},{"$f":"IFERROR(VLOOKUP(C29,テーブル7[],2,FALSE),\"\")","v":""},{"$f":"IFERROR(VLOOKUP(C29,テーブル8[],2,FALSE),\"\")","v":""}]
[{"$f":"IFERROR(VLOOKUP(C30,祝日など!$A$2:$B$55,2,FALSE),\"\")&IFERROR(VLOOKUP(C30,祝日など!$D$2:$E$15,2,FALSE),\"\")","v":""},null,"2025-12-26",{"$f":"C30","v":46017},{"$f":"IFERROR(VLOOKUP(C30,テーブル4[],2,0),\"\")","v":"生命・環境セミナー\n（白石）"},{"$f":"IFERROR(VLOOKUP(C30,テーブル5[],2,FALSE),\"\")","v":"生命・環境セミナー\n（白石）"},{"$f":"IFERROR(VLOOKUP(C30,テーブル84[],2,FALSE),\"\")","v":""},{"$f":"IFERROR(VLOOKUP(C30,テーブル6[],2,FALSE),\"\")","v":"地球外物質セミナー\n（宮原・小池）"},{"$f":"IFERROR(VLOOKUP(C30,テーブル7[],2,FALSE),\"\")","v":""},{"$f":"IFERROR(VLOOKUP(C30,テーブル8[],2,FALSE),\"\")","v":""}]
[{"$f":"IFERROR(VLOOKUP(C31,祝日など!$A$2:$B$55,2,FALSE),\"\")&IFERROR(VLOOKUP(C31,祝日など!$D$2:$E$15,2,FALSE),\"\")","v":""},null,"2025-12-27",46018,{"$f":"IFERROR(VLOOKUP(C31,テーブル4[],2,0),\"\")","v":""},{"$f":"IFERROR(VLOOKUP(C31,テーブル5[],2,FALSE),\"\")","v":""},{"$f":"IFERROR(VLOOKUP(C31,テーブル84[],2,FALSE),\"\")","v":""},{"$f":"IFERROR(VLOOKUP(C31,テーブル6[],2,FALSE),\"\")","v":""},{"$f":"IFERROR(VLOOKUP(C31,テーブル7[],2,FALSE),\"\")","v":""},{"$f":"IFERROR(VLOOKUP(C31,テーブル8[],2,FALSE),\"\")","v":""}]
[{"$f":"IFERROR(VLOOKUP(C32,祝日など!$A$2:$B$55,2,FALSE),\"\")&IFERROR(VLOOKUP(C32,祝日など!$D$2:$E$15,2,FALSE),\"\")","v":""},null,{"$f":"C31+1","v":"2025-12-28"},46019,{"$f":"IFERROR(VLOOKUP(C32,テーブル4[],2,0),\"\")","v":""},{"$f":"IFERROR(VLOOKUP(C32,テーブル5[],2,FALSE),\"\")","v":""},{"$f":"IFERROR(VLOOKUP(C32,テーブル84[],2,FALSE),\"\")","v":""},{"$f":"IFERROR(VLOOKUP(C32,テーブル6[],2,FALSE),\"\")","v":""},{"$f":"IFERROR(VLOOKUP(C32,テーブル7[],2,FALSE),\"\")","v":""},{"$f":"IFERROR(VLOOKUP(C32,テーブル8[],2,FALSE),\"\")","v":""}]
[{"$f":"IFERROR(VLOOKUP(C33,祝日など!$A$2:$B$55,2,FALSE),\"\")&IFERROR(VLOOKUP(C33,祝日など!$D$2:$E$15,2,FALSE),\"\")","v":"冬季休業"},null,{"$f":"IF(C32=\"\",\"\",IF(DAY(C32+1)=1,\"\",C32+1))","v":"2025-12-29"},46020,{"$f":"IFERROR(VLOOKUP(C33,テーブル4[],2,0),\"\")","v":""},{"$f":"IFERROR(VLOOKUP(C33,テーブル5[],2,FALSE),\"\")","v":""},{"$f":"IFERROR(VLOOKUP(C33,テーブル84[],2,FALSE),\"\")","v":""},{"$f":"IFERROR(VLOOKUP(C33,テーブル6[],2,FALSE),\"\")","v":""},{"$f":"IFERROR(VLOOKUP(C33,テーブル7[],2,FALSE),\"\")","v":""},{"$f":"IFERROR(VLOOKUP(C33,テーブル8[],2,FALSE),\"\")","v":""}]
[{"$f":"IFERROR(VLOOKUP(C34,祝日など!$A$2:$B$55,2,FALSE),\"\")&IFERROR(VLOOKUP(C34,祝日など!$D$2:$E$15,2,FALSE),\"\")","v":"冬季休業"},null,{"$f":"IF(C33=\"\",\"\",IF(DAY(C33+1)=1,\"\",C33+1))","v":"2025-12-30"},46021,{"$f":"IFERROR(VLOOKUP(C34,テーブル4[],2,0),\"\")","v":""},{"$f":"IFERROR(VLOOKUP(C34,テーブル5[],2,FALSE),\"\")","v":""},{"$f":"IFERROR(VLOOKUP(C34,テーブル84[],2,FALSE),\"\")","v":""},{"$f":"IFERROR(VLOOKUP(C34,テーブル6[],2,FALSE),\"\")","v":""},{"$f":"IFERROR(VLOOKUP(C34,テーブル7[],2,FALSE),\"\")","v":""},{"$f":"IFERROR(VLOOKUP(C34,テーブル8[],2,FALSE),\"\")","v":""}]
[{"$f":"IFERROR(VLOOKUP(C35,祝日など!$A$2:$B$55,2,FALSE),\"\")&IFERROR(VLOOKUP(C35,祝日など!$D$2:$E$15,2,FALSE),\"\")","v":"冬季休業"},null,"2025-12-31",46022,{"$f":"IFERROR(VLOOKUP(C35,テーブル4[],2,0),\"\")","v":""},{"$f":"IFERROR(VLOOKUP(C35,テーブル5[],2,FALSE),\"\")","v":""},{"$f":"IFERROR(VLOOKUP(C35,テーブル84[],2,FALSE),\"\")","v":""},{"$f":"IFERROR(VLOOKUP(C35,テーブル6[],2,FALSE),\"\")","v":""},{"$f":"IFERROR(VLOOKUP(C35,テーブル7[],2,FALSE),\"\")","v":""},{"$f":"IFERROR(VLOOKUP(C35,テーブル8[],2,FALSE),\"\")","v":""}]

{"sheet":"祝日など","index":1,"n_rows":55,"n_cols":5,"rows_kept":55,"cut":false,"hidden":false,"merged":[]}
["祝日の日付","名称",null,"授業関係日付","授業関係"]
["2025-01-01","元日",null,"2025-04-08","第1ターム開始"]
["2025-01-02","休日",null,"2025-05-01","振替授業(火)"]
["2025-01-03","休日",null,"2025-05-07","振替授業(月)"]
["2025-01-13","成人の日",null,"2025-06-06","第2ターム開始"]
["2025-02-11","建国記念の日",null,"2025-07-18","振替授業(月)"]
["2025-02-23","天皇誕生日",null,"2025-08-04","夏季休暇開始"]
["2025-02-24","振替休日",null,"2025-10-02","第3ターム開始"]
["2025-03-20","春分の日",null,"2025-10-16","振替授業(月)"]
["2025-04-29","昭和の日",null,"2025-11-07","振替授業(月)"]
["2025-05-03","憲法記念日",null,"2025-12-02","第4ターム開始"]
["2025-05-04","みどりの日",null,"2025-12-25","振替授業(金)"]
["2025-05-05","こどもの日",null,"2026-01-06","振替授業(月)"]
["2025-05-06","振替休日",null,"2026-01-14","振替授業(月)"]
["2025-07-21","海の日",null,"2026-02-09","冬季休暇開始"]
["2025-08-11","山の日"]
["2025-08-12","夏季休業"]
["2025-08-13","夏季休業"]
["2025-08-14","夏季休業"]
["2025-08-15","夏季休業"]
["2025-09-15","敬老の日"]
["2025-09-23","秋分の日"]
["2025-10-13","スポーツの日"]
["2025-11-03","文化の日"]
["2025-11-23","勤労感謝の日"]
["2025-11-24","振替休日"]
["2025-12-29","冬季休業"]
["2025-12-30","冬季休業"]
["2025-12-31","冬季休業"]
["2026-01-01","元日"]
["2026-01-02","休日"]
["2026-01-03","休日"]
["2026-01-12","成人の日"]
["2026-02-11","建国記念の日"]
["2026-02-23","天皇誕生日"]
["2026-03-20","春分の日"]
["2026-04-29","昭和の日"]
["2026-05-03","憲法記念日"]
["2026-05-04","みどりの日"]
["2026-05-05","こどもの日"]
["2026-05-06","振替休日"]
["2026-07-20","海の日"]
["2026-08-11","山の日"]
["2026-08-12","夏季休業"]
["2026-08-13","夏季休業"]
["2026-08-14","夏季休業"]
["2026-09-21","敬老の日"]
["2026-09-22","振替休日"]
["2026-09-23","秋分の日"]
["2026-10-12","スポーツの日"]
["2026-11-03","文化の日"]
["2026-11-23","勤労感謝の日"]
["2026-12-29","冬季休業"]
["2026-12-30","冬季休業"]
["2026-12-31","冬季休業"]

{"sheet":"9-10時限","index":2,"n_rows":103,"n_cols":2,"rows_kept":103,"cut":false,"hidden":false,"merged":[]}
["日付","9-10時限"]
["2025-04-08","地球外物質セミナー\n（宮原・小池）"]
["2025-04-09","LIRGセミナー\n（柴田・秋澤・DEY・平山）"]
["2025-04-10","岩石変形セミナー\n（片山・岡﨑）"]
["2025-04-15","地球外物質セミナー\n（宮原・小池）"]
["2025-04-16","LIRGセミナー\n（柴田・秋澤・DEY・平山）"]
["2025-04-17","岩石変形セミナー\n（片山・岡﨑）"]
["2025-04-22","地球外物質セミナー\n（宮原・小池）"]
["2025-04-23","LIRGセミナー\n（柴田・秋澤・DEY・平山）"]
["2025-04-24","岩石変形セミナー\n（片山・岡﨑）"]
["2025-04-28","教員会"]
["2025-04-30","LIRGセミナー\n（柴田・秋澤・DEY・平山）"]
["2025-05-01","地球外物質セミナー\n（宮原・小池）"]
["2025-05-07","LIRGセミナー\n（柴田・秋澤・DEY・平山）"]
["2025-05-08","岩石変形セミナー\n（片山・岡﨑）"]
["2025-05-13","地球外物質セミナー\n（宮原・小池）"]
["2025-05-14","LIRGセミナー\n（柴田・秋澤・DEY・平山）"]
["2025-05-15","岩石変形セミナー\n（片山・岡﨑）"]
["2025-05-19","教員会"]
["2025-05-20","地球外物質セミナー\n（宮原・小池）"]
["2025-05-21","LIRGセミナー\n（柴田・秋澤・DEY・平山）"]
["2025-05-22","岩石変形セミナー\n（片山・岡﨑）"]
["2025-05-27","地球外物質セミナー\n（宮原・小池）"]
["2025-05-28","LIRGセミナー\n（柴田・秋澤・DEY・平山）"]
["2025-05-29","岩石変形セミナー\n（片山・岡﨑）"]
["2025-06-03","地球外物質セミナー\n（宮原・小池）"]
["2025-06-04","LIRGセミナー\n（柴田・秋澤・DEY・平山）"]
["2025-06-05","岩石変形セミナー\n（片山・岡﨑）"]
["2025-06-10","地球外物質セミナー\n（宮原・小池）"]
["2025-06-11","LIRGセミナー\n（柴田・秋澤・DEY・平山）"]
["2025-06-12","岩石変形セミナー\n（片山・岡﨑）"]
["2025-06-17","地球外物質セミナー\n（宮原・小池）"]
["2025-06-18","LIRGセミナー\n（柴田・秋澤・DEY・平山）"]
["2025-06-19","岩石変形セミナー\n（片山・岡﨑）"]
["2025-06-24","地球外物質セミナー\n（宮原・小池）"]
["2025-06-25","LIRGセミナー\n（柴田・秋澤・DEY・平山）"]
["2025-06-26","岩石変形セミナー\n（片山・岡﨑）"]
["2025-06-30","教員会"]
["2025-07-01","地球外物質セミナー\n（宮原・小池）"]
["2025-07-02","LIRGセミナー\n（柴田・秋澤・DEY・平山）"]
["2025-07-03","岩石変形セミナー\n（片山・岡﨑）"]
["2025-07-07","薮田会議"]
["2025-07-08","地球外物質セミナー\n（宮原・小池）"]
["2025-07-09","LIRGセミナー\n（柴田・秋澤・DEY・平山）"]
["2025-07-10","岩石変形セミナー\n（片山・岡﨑）"]
["2025-07-14","←　片山　→"]
["2025-07-15","地球外物質セミナー\n（宮原・小池）"]
["2025-07-16","LIRGセミナー\n（柴田・秋澤・DEY・平山）"]
["2025-07-17","岩石変形セミナー\n（片山・岡﨑）"]
["2025-07-22","地球外物質セミナー\n（宮原・小池）"]
["2025-07-23","LIRGセミナー\n（柴田・秋澤・DEY・平山）"]
["2025-07-24","岩石変形セミナー\n（片山・岡﨑）"]
["2025-07-28","教員会"]
["2025-07-29","地球外物質セミナー\n（宮原・小池）"]
["2025-07-30","LIRGセミナー\n（柴田・秋澤・DEY・平山）"]
["2025-07-31","岩石変形セミナー\n（片山・岡﨑）"]
["2025-08-25","教員会"]
["2025-08-31","全学停電（8：30～18：00）"]
["2025-09-03","R5年度生面談・控室（須田）"]
["2025-09-06","←　DUTTA（17:30-19:00）→"]
["2025-09-16","R5年度生面談・控室（須田）"]
["2025-09-26","R5年度生面談・控室（須田）"]
["2025-09-29","教員会"]
["2025-10-02","岩石変形セミナー\n（片山・岡﨑）"]
["2025-10-08","LIRGセミナー\n（柴田・秋澤・平山）"]
["2025-10-09","岩石変形セミナー\n（片山・岡﨑）"]
["2025-10-15","LIRGセミナー\n（柴田・秋澤・平山）"]
["2025-10-20","教員会"]
["2025-10-23","岩石変形セミナー\n（片山・岡﨑）"]
["2025-10-29","LIRGセミナー\n（柴田・秋澤・平山）"]
["2025-10-30","岩石変形セミナー\n（片山・岡﨑）"]
["2025-11-05","LIRGセミナー\n（柴田・秋澤・平山）"]
["2025-11-06","岩石変形セミナー\n（片山・岡﨑）"]
["2025-11-12","LIRGセミナー\n（柴田・秋澤・平山）"]
["2025-11-13","岩石変形セミナー\n（片山・岡﨑）"]
["2025-11-17","教員会"]
["2025-11-19","LIRGセミナー\n（柴田・秋澤・平山）"]
["2025-11-20","岩石変形セミナー\n（片山・岡﨑）"]
["2025-11-26","LIRGセミナー\n（柴田・秋澤・平山）"]
["2025-11-27","岩石変形セミナー\n（片山・岡﨑）"]
["2025-12-03","LIRGセミナー\n（柴田・秋澤・平山）"]
["2025-12-04","岩石変形セミナー\n（片山・岡﨑）"]
["2025-12-10","LIRGセミナー\n（柴田・秋澤・平山）"]
["2025-12-11","岩石変形セミナー\n（片山・岡﨑）"]
["2025-12-17","LIRGセミナー\n（柴田・秋澤・平山）"]
["2025-12-18","岩石変形セミナー\n（片山・岡﨑）"]
["2025-12-22","教員会"]
["2025-12-20","改修用停電"]
["2025-12-21","改修用停電"]
["2025-12-24","LIRGセミナー\n（柴田・秋澤・平山）"]
["2026-01-07","LIRGセミナー\n（柴田・秋澤・平山）"]
["2026-01-08","岩石変形セミナー\n（片山・岡﨑）"]
["2026-01-15","岩石変形セミナー\n（片山・岡﨑）"]
["2026-01-21","LIRGセミナー\n（柴田・秋澤・平山）"]
["2026-01-22","岩石変形セミナー\n（片山・岡﨑）"]
["2026-01-26","教員会"]
["2026-01-29","岩石変形セミナー\n（片山・岡﨑）"]
["2026-02-04","LIRGセミナー\n（柴田・秋澤・平山）"]
["2026-02-05","岩石変形セミナー\n（片山・岡﨑）"]
["2026-02-12","D入試"]
["2026-02-13","懇談会"]
["2026-02-16","教員会"]
["2026-03-30","教員会"]

{"sheet":"7-8時限","index":3,"n_rows":91,"n_cols":2,"rows_kept":91,"cut":false,"hidden":false,"merged":[]}
["日付","7-8時限"]
["2025-04-07","生命・環境セミナー\n（白石）"]
["2025-04-08","地球外物質セミナー\n（宮原・小池）"]
["2025-04-09","LIRGセミナー\n（柴田・秋澤・DEY・平山）"]
["2025-04-14","生命・環境セミナー\n（白石）"]
["2025-04-15","地球外物質セミナー\n（宮原・小池）"]
["2025-04-16","LIRGセミナー\n（柴田・秋澤・DEY・平山）"]
["2025-04-21","生命・環境セミナー\n（白石）"]
["2025-04-22","地球外物質セミナー\n（宮原・小池）"]
["2025-04-23","LIRGセミナー\n（柴田・秋澤・DEY・平山）"]
["2025-04-28","生命・環境セミナー\n（白石）"]
["2025-04-30","LIRGセミナー\n（柴田・秋澤・DEY・平山）"]
["2025-05-01","地球外物質セミナー\n（宮原・小池）"]
["2025-05-07","LIRGセミナー\n（柴田・秋澤・DEY・平山）"]
["2025-05-12","生命・環境セミナー\n（白石）"]
["2025-05-13","地球外物質セミナー\n（宮原・小池）"]
["2025-05-14","LIRGセミナー\n（柴田・秋澤・DEY・平山）"]
["2025-05-19","生命・環境セミナー\n（白石）"]
["2025-05-20","地球外物質セミナー\n（宮原・小池）"]
["2025-05-21","LIRGセミナー\n（柴田・秋澤・DEY・平山）"]
["2025-05-26","生命・環境セミナー\n（白石）"]
["2025-05-27","地球外物質セミナー\n（宮原・小池）"]
["2025-05-28","LIRGセミナー\n（柴田・秋澤・DEY・平山）"]
["2025-06-02","生命・環境セミナー\n（白石）"]
["2025-06-03","地球外物質セミナー\n（宮原・小池）"]
["2025-06-04","LIRGセミナー\n（柴田・秋澤・DEY・平山）"]
["2025-06-09","生命・環境セミナー\n（白石）"]
["2025-06-10","地球外物質セミナー\n（宮原・小池）"]
["2025-06-11","LIRGセミナー\n（柴田・秋澤・DEY・平山）"]
["2025-06-16","生命・環境セミナー\n（白石）"]
["2025-06-17","地球外物質セミナー\n（宮原・小池）"]
["2025-06-18","LIRGセミナー\n（柴田・秋澤・DEY・平山）"]
["2025-06-23","生命・環境セミナー\n（白石）"]
["2025-06-24","地球外物質セミナー\n（宮原・小池）"]
["2025-06-25","LIRGセミナー\n（柴田・秋澤・DEY・平山）"]
["2025-06-30","生命・環境セミナー\n（白石）"]
["2025-07-01","地球外物質セミナー\n（宮原・小池）"]
["2025-07-02","LIRGセミナー\n（柴田・秋澤・DEY・平山）"]
["2025-07-07","生命・環境セミナー\n（白石）"]
["2025-07-08","地球外物質セミナー\n（宮原・小池）"]
["2025-07-09","LIRGセミナー\n（柴田・秋澤・DEY・平山）"]
["2025-07-14","生命・環境セミナー\n（白石）"]
["2025-07-15","地球外物質セミナー\n（宮原・小池）"]
["2025-07-16","LIRGセミナー\n（柴田・秋澤・DEY・平山）"]
["2025-07-18","生命・環境セミナー\n（白石）"]
["2025-07-22","地球外物質セミナー\n（宮原・小池）"]
["2025-07-23","LIRGセミナー\n（柴田・秋澤・DEY・平山）"]
["2025-07-29","地球外物質セミナー\n（宮原・小池）"]
["2025-07-30","LIRGセミナー\n（柴田・秋澤・DEY・平山）"]
["2025-08-31","全学停電（8：30～18：00）"]
["2025-09-01","岡﨑セミナー"]
["2025-09-03","R5年度生面談・控室（須田）"]
["2025-09-06","←　Swarnaa　→"]
["2025-09-16","R5年度生面談・控室（須田）"]
["2025-09-26","R5年度生面談・控室（須田）"]
["2025-10-02","内物セミナー\n（須田・中久喜）"]
["2025-10-08","LIRGセミナー\n（柴田・秋澤・平山）"]
["2025-10-09","内物セミナー\n（須田・中久喜）"]
["2025-10-15","LIRGセミナー\n（柴田・秋澤・平山）"]
["2025-10-22","LIRGセミナー\n（柴田・秋澤・平山）"]
["2025-10-23","内物セミナー\n（須田・中久喜）"]
["2025-10-29","LIRGセミナー\n（柴田・秋澤・平山）"]
["2025-10-30","内物セミナー\n（須田・中久喜）"]
["2025-11-05","LIRGセミナー\n（柴田・秋澤・平山）"]
["2025-11-06","内物セミナー\n（須田・中久喜）"]
["2025-11-12","LIRGセミナー\n（柴田・秋澤・平山）"]
["2025-11-13","内物セミナー\n（須田・中久喜）"]
["2025-11-19","LIRGセミナー\n（柴田・秋澤・平山）"]
["2025-11-20","内物セミナー\n（須田・中久喜）"]
["2025-11-26","LIRGセミナー\n（柴田・秋澤・平山）"]
["2025-11-27","内物セミナー\n（須田・中久喜）"]
["2025-12-03","LIRGセミナー\n（柴田・秋澤・平山）"]
["2025-12-04","内物セミナー\n（須田・中久喜）"]
["2025-12-10","LIRGセミナー\n（柴田・秋澤・平山）"]
["2025-12-11","内物セミナー\n（須田・中久喜）"]
["2025-12-12","㈱コベルコ科研 会社説明会"]
["2025-12-17","LIRGセミナー\n（柴田・秋澤・平山）"]
["2025-12-18","内物セミナー\n（須田・中久喜）"]
["2025-12-20","改修用停電"]
["2025-12-21","改修用停電"]
["2025-12-24","LIRGセミナー\n（柴田・秋澤・平山）"]
["2026-01-07","LIRGセミナー\n（柴田・秋澤・平山）"]
["2026-01-08","内物セミナー\n（須田・中久喜）"]
["2026-01-15","内物セミナー\n（須田・中久喜）"]
["2026-01-21","LIRGセミナー\n（柴田・秋澤・平山）"]
["2026-01-22","内物セミナー\n（須田・中久喜）"]
["2026-01-29","内物セミナー\n（須田・中久喜）"]
["2026-02-04","LIRGセミナー\n（柴田・秋澤・平山）"]
["2026-02-05","内物セミナー\n（須田・中久喜）"]
["2026-02-12","D入試"]
["2026-02-13","懇談会"]

{"sheet":"5-6時限","index":4,"n_rows":44,"n_cols":2,"rows_kept":44,"cut":false,"hidden":false,"merged":[]}
["日付","5-6時限"]
["2025-04-07","生命・環境セミナー\n（白石）"]
["2025-04-14","生命・環境セミナー\n（白石）"]
["2025-04-21","生命・環境セミナー\n（白石）"]
["2025-04-28","生命・環境セミナー\n（白石）"]
["2025-05-12","生命・環境セミナー\n（白石）"]
["2025-05-19","生命・環境セミナー\n（白石）"]
["2025-05-26","生命・環境セミナー\n（白石）"]
["2025-06-02","生命・環境セミナー\n（白石）"]
["2025-06-09","生命・環境セミナー\n（白石）"]
["2025-06-16","生命・環境セミナー\n（白石）"]
["2025-06-23","生命・環境セミナー\n（白石）"]
["2025-06-30","生命・環境セミナー\n（白石）"]
["2025-07-07","生命・環境セミナー\n（白石）"]
["2025-07-11","鈴村セミナー（秋澤）"]
["2025-07-14","生命・環境セミナー\n（白石）"]
["2025-07-18","生命・環境セミナー\n（白石）"]
["2025-08-26","D論審査（口述試験）"]
["2025-08-31","全学停電（8：30～18：00）"]
["2025-09-01","岡﨑セミナー"]
["2025-09-03","R5年度生面談・控室（須田）"]
["2025-09-16","R5年度生面談・控室（須田）"]
["2025-09-26","R5年度生面談・控室（須田）"]
["2025-10-03","地球外物質セミナー\n（宮原・小池）"]
["2025-10-10","地球外物質セミナー\n（宮原・小池）"]
["2025-10-17","地球外物質セミナー\n（宮原・小池）"]
["2025-10-31","地球外物質セミナー\n（宮原・小池）"]
["2025-11-14","地球外物質セミナー\n（宮原・小池）"]
["2025-11-21","地球外物質セミナー\n（宮原・小池）"]
["2025-11-28","地球外物質セミナー\n（宮原・小池）"]
["2025-12-05","地球外物質セミナー\n（宮原・小池）"]
["2025-12-12","地球外物質セミナー\n（宮原・小池）"]
["2025-12-19","地球外物質セミナー\n（宮原・小池）"]
["2025-12-20","改修用停電"]
["2025-12-21","改修用停電"]
["2025-12-25","地球外物質セミナー\n（宮原・小池）"]
["2025-12-26","地球外物質セミナー\n（宮原・小池）"]
["2026-01-09","地球外物質セミナー\n（宮原・小池）"]
["2026-01-16","地球外物質セミナー\n（宮原・小池）"]
["2026-01-23","地球外物質セミナー\n（宮原・小池）"]
["2026-01-30","地球外物質セミナー\n（宮原・小池）"]
["2026-02-06","地球外物質セミナー\n（宮原・小池）"]
["2026-02-12","D入試"]
["2026-02-13","懇談会"]

{"sheet":"昼休憩","index":5,"n_rows":9,"n_cols":2,"rows_kept":9,"cut":false,"hidden":false,"merged":[]}
["日付","昼休憩"]
["2025-08-31","停電"]
["2025-09-03","須田"]
["2025-09-16","須田"]
["2025-09-26","須田"]
["2025-12-20","停電"]
["2025-12-21","停電"]
["2026-02-12","D入試"]
["2026-02-13","懇談会"]

{"sheet":"3-4時限","index":6,"n_rows":78,"n_cols":2,"rows_kept":78,"cut":false,"hidden":false,"merged":[]}
["日付","3-4時限"]
["2025-04-08","有機宇宙地球化学セミナー\n（薮田）"]
["2025-04-10","内物セミナー\n（須田・中久喜）"]
["2025-04-15","有機宇宙地球化学セミナー\n（薮田）"]
["2025-04-17","内物セミナー\n（須田・中久喜）"]
["2025-04-22","有機宇宙地球化学セミナー\n（薮田）"]
["2025-04-24","内物セミナー\n（須田・中久喜）"]
["2025-05-01","有機宇宙地球化学セミナー\n（薮田）"]
["2025-05-08","内物セミナー\n（須田・中久喜）"]
["2025-05-13","有機宇宙地球化学セミナー\n（薮田）"]
["2025-05-15","内物セミナー\n（須田・中久喜）"]
["2025-05-20","有機宇宙地球化学セミナー\n（薮田）"]
["2025-05-22","内物セミナー\n（須田・中久喜）"]
["2025-05-27","有機宇宙地球化学セミナー\n（薮田）"]
["2025-05-29","内物セミナー\n（須田・中久喜）"]
["2025-06-03","有機宇宙地球化学セミナー\n（薮田）"]
["2025-06-05","内物セミナー\n（須田・中久喜）"]
["2025-06-10","有機宇宙地球化学セミナー\n（薮田）"]
["2025-06-12","内物セミナー\n（須田・中久喜）"]
["2025-06-17","有機宇宙地球化学セミナー\n（薮田）"]
["2025-06-19","内物セミナー\n（須田・中久喜）"]
["2025-06-24","有機宇宙地球化学セミナー\n（薮田）"]
["2025-06-26","内物セミナー\n（須田・中久喜）"]
["2025-07-01","有機宇宙地球化学セミナー\n（薮田）"]
["2025-07-03","内物セミナー\n（須田・中久喜）"]
["2025-07-08","有機宇宙地球化学セミナー\n（薮田）"]
["2025-07-10","内物セミナー\n（須田・中久喜）"]
["2025-07-15","有機宇宙地球化学セミナー\n（薮田）"]
["2025-07-17","内物セミナー\n（須田・中久喜）"]
["2025-07-18","柴田研"]
["2025-07-22","有機宇宙地球化学セミナー\n（薮田）"]
["2025-07-24","内物セミナー\n（須田・中久喜）"]
["2025-07-28","生命・環境セミナー\n（白石）"]
["2025-07-29","有機宇宙地球化学セミナー\n（薮田）"]
["2025-07-31","内物セミナー\n（須田・中久喜）"]
["2025-08-31","全学停電（8：30～18：00）"]
["2025-09-01","岡﨑セミナー"]
["2025-09-03","R5年度生面談・控室（須田）"]
["2025-09-05","←　室井　→"]
["2025-09-16","R5年度生面談・控室（須田）"]
["2025-09-26","R5年度生面談・控室（須田）"]
["2025-10-03","生命・環境セミナー\n（白石）"]
["2025-10-07","有機宇宙地球化学セミナー\n（薮田）"]
["2025-10-10","生命・環境セミナー\n（白石）"]
["2025-10-14","有機宇宙地球化学セミナー\n（薮田）"]
["2025-10-17","生命・環境セミナー\n（白石）"]
["2025-10-21","有機宇宙地球化学セミナー\n（薮田）"]
["2025-10-24","生命・環境セミナー\n（白石）"]
["2025-10-28","有機宇宙地球化学セミナー\n（薮田）"]
["2025-10-31","生命・環境セミナー\n（白石）"]
["2025-11-04","有機宇宙地球化学セミナー\n（薮田）"]
["2025-11-11","有機宇宙地球化学セミナー\n（薮田）"]
["2025-11-14","生命・環境セミナー\n（白石）"]
["2025-11-18","有機宇宙地球化学セミナー\n（薮田）"]
["2025-11-21","生命・環境セミナー\n（白石）"]
["2025-11-25","有機宇宙地球化学セミナー\n（薮田）"]
["2025-11-28","生命・環境セミナー\n（白石）"]
["2025-12-02","有機宇宙地球化学セミナー\n（薮田）"]
["2025-12-05","生命・環境セミナー\n（白石）"]
["2025-12-09","有機宇宙地球化学セミナー\n（薮田）"]
["2025-12-12","生命・環境セミナー\n（白石）"]
["2025-12-16","有機宇宙地球化学セミナー\n（薮田）"]
["2025-12-20","改修用停電"]
["2025-12-21","改修用停電"]
["2025-12-23","有機宇宙地球化学セミナー\n（薮田）"]
["2025-12-25","生命・環境セミナー\n（白石）"]
["2025-12-26","生命・環境セミナー\n（白石）"]
["2026-01-09","生命・環境セミナー\n（白石）"]
["2026-01-13","有機宇宙地球化学セミナー\n（薮田）"]
["2026-01-16","生命・環境セミナー\n（白石）"]
["2026-01-20","有機宇宙地球化学セミナー\n（薮田）"]
["2026-01-23","生命・環境セミナー\n（白石）"]
["2026-01-27","有機宇宙地球化学セミナー\n（薮田）"]
["2026-01-30","生命・環境セミナー\n（白石）"]
["2026-02-03","有機宇宙地球化学セミナー\n（薮田）"]
["2026-02-06","生命・環境セミナー\n（白石）"]
["2026-02-12","D入試"]
["2026-02-13","懇談会"]

{"sheet":"1-2時限","index":7,"n_rows":77,"n_cols":2,"rows_kept":77,"cut":false,"hidden":false,"merged":[]}
["日付","1-2時限"]
["2025-04-08","有機宇宙地球化学セミナー\n10時～（薮田）"]
["2025-04-10","PRDセミナー\n（安東・DAS）"]
["2025-04-15","有機宇宙地球化学セミナー\n10時～（薮田）"]
["2025-04-17","PRDセミナー\n（安東・DAS）"]
["2025-04-22","有機宇宙地球化学セミナー\n10時～（薮田）"]
["2025-04-24","PRDセミナー\n（安東・DAS）"]
["2025-05-01","有機宇宙地球化学セミナー\n10時～（薮田）"]
["2025-05-08","PRDセミナー\n（安東・DAS）"]
["2025-05-13","有機宇宙地球化学セミナー\n10時～（薮田）"]
["2025-05-15","PRDセミナー\n（安東・DAS）"]
["2025-05-20","有機宇宙地球化学セミナー\n10時～（薮田）"]
["2025-05-22","PRDセミナー\n（安東・DAS）"]
["2025-05-27","有機宇宙地球化学セミナー\n10時～（薮田）"]
["2025-05-29","PRDセミナー\n（安東・DAS）"]
["2025-06-03","有機宇宙地球化学セミナー\n10時～（薮田）"]
["2025-06-05","PRDセミナー\n（安東・DAS）"]
["2025-06-10","有機宇宙地球化学セミナー\n10時～（薮田）"]
["2025-06-12","PRDセミナー\n（安東・DAS）"]
["2025-06-17","有機宇宙地球化学セミナー\n10時～（薮田）"]
["2025-06-19","有機宇宙地球化学セミナー\n10時～（薮田）"]
["2025-06-24","PRDセミナー\n（安東・DAS）"]
["2025-06-26","有機宇宙地球化学セミナー\n10時～（薮田）"]
["2025-07-01","PRDセミナー\n（安東・DAS）"]
["2025-07-03","有機宇宙地球化学セミナー\n10時～（薮田）"]
["2025-07-08","PRDセミナー\n（安東・DAS）"]
["2025-07-10","有機宇宙地球化学セミナー\n10時～（薮田）"]
["2025-07-15","PRDセミナー\n（安東・DAS）"]
["2025-07-17","有機宇宙地球化学セミナー\n10時～（薮田）"]
["2025-07-18","10時～柴田研"]
["2025-07-22","PRDセミナー\n（安東・DAS）"]
["2025-07-24","有機宇宙地球化学セミナー\n10時～（薮田）"]
["2025-07-28","生命・環境セミナー\n（白石）"]
["2025-07-29","PRDセミナー\n（安東・DAS）"]
["2025-07-31","有機宇宙地球化学セミナー\n10時～（薮田）"]
["2025-08-31","全学停電（8：30～18：00）"]
["2025-09-01","岡﨑セミナー"]
["2025-09-03","R5年度生面談・控室（須田）"]
["2025-09-16","R5年度生面談・控室（須田）"]
["2025-09-26","R5年度生面談・控室（須田）"]
["2025-10-03","生命・環境セミナー\n（白石）"]
["2025-10-07","有機宇宙地球化学セミナー\n10時～（薮田）"]
["2025-10-10","生命・環境セミナー\n（白石）"]
["2025-10-14","有機宇宙地球化学セミナー\n10時～（薮田）"]
["2025-10-17","生命・環境セミナー\n（白石）"]
["2025-10-21","有機宇宙地球化学セミナー\n10時～（薮田）"]
["2025-10-24","生命・環境セミナー\n（白石）"]
["2025-10-28","有機宇宙地球化学セミナー\n10時～（薮田）"]
["2025-10-31","生命・環境セミナー\n（白石）"]
["2025-11-04","有機宇宙地球化学セミナー\n10時～（薮田）"]
["2025-11-11","有機宇宙地球化学セミナー\n10時～（薮田）"]
["2025-11-14","生命・環境セミナー\n（白石）"]
["2025-11-18","有機宇宙地球化学セミナー\n10時～（薮田）"]
["2025-11-21","生命・環境セミナー\n（白石）"]
["2025-11-25","有機宇宙地球化学セミナー\n10時～（薮田）"]
["2025-11-28","生命・環境セミナー\n（白石）"]
["2025-12-02","有機宇宙地球化学セミナー\n10時～（薮田）"]
["2025-12-05","生命・環境セミナー\n（白石）"]
["2025-12-09","有機宇宙地球化学セミナー\n10時～（薮田）"]
["2025-12-12","生命・環境セミナー\n（白石）"]
["2025-12-16","有機宇宙地球化学セミナー\n10時～（薮田）"]
["2025-12-20","改修用停電"]
["2025-12-21","改修用停電"]
["2025-12-23","有機宇宙地球化学セミナー\n10時～（薮田）"]
["2025-12-25","生命・環境セミナー\n（白石）"]
["2025-12-26","生命・環境セミナー\n（白石）"]
["2026-01-09","生命・環境セミナー\n（白石）"]
["2026-01-13","有機宇宙地球化学セミナー\n10時～（薮田）"]
["2026-01-16","生命・環境セミナー\n（白石）"]
["2026-01-20","有機宇宙地球化学セミナー\n10時～（薮田）"]
["2026-01-23","生命・環境セミナー\n（白石）"]
["2026-01-27","有機宇宙地球化学セミナー\n10時～（薮田）"]
["2026-01-30","生命・環境セミナー\n（白石）"]
["2026-02-03","有機宇宙地球化学セミナー\n10時～（薮田）"]
["2026-02-06","生命・環境セミナー\n（白石）"]
["2026-02-12","D入試"]
["2026-02-13","懇談会"]

{"sheet":"セミナー","index":8,"n_rows":366,"n_cols":9,"rows_kept":366,"cut":false,"hidden":false,"merged":[]}
["日付","曜日","祝日など","1-2時限","3-4時限","昼休憩","5-6時限","7-8時限","9-10時限"]
["2025-04-01","(火)",{"$f":"IFERROR(VLOOKUP(A2,テーブル1[],2,FALSE),\"\")&IFERROR(VLOOKUP(A2,祝日など!$D$2:$E$15,2,FALSE),\"\")","v":""}]
["2025-04-02","(水)",{"$f":"IFERROR(VLOOKUP(A3,テーブル1[],2,FALSE),\"\")&IFERROR(VLOOKUP(A3,祝日など!$D$2:$E$15,2,FALSE),\"\")","v":""}]
["2025-04-03","(木)",{"$f":"IFERROR(VLOOKUP(A4,テーブル1[],2,FALSE),\"\")&IFERROR(VLOOKUP(A4,祝日など!$D$2:$E$15,2,FALSE),\"\")","v":""}]
["2025-04-04","(金)",{"$f":"IFERROR(VLOOKUP(A5,テーブル1[],2,FALSE),\"\")&IFERROR(VLOOKUP(A5,祝日など!$D$2:$E$15,2,FALSE),\"\")","v":""}]
["2025-04-05","(土)",{"$f":"IFERROR(VLOOKUP(A6,テーブル1[],2,FALSE),\"\")&IFERROR(VLOOKUP(A6,祝日など!$D$2:$E$15,2,FALSE),\"\")","v":""}]
["2025-04-06","(日)",{"$f":"IFERROR(VLOOKUP(A7,テーブル1[],2,FALSE),\"\")&IFERROR(VLOOKUP(A7,祝日など!$D$2:$E$15,2,FALSE),\"\")","v":""}]
["2025-04-07","(月)",{"$f":"IFERROR(VLOOKUP(A8,テーブル1[],2,FALSE),\"\")&IFERROR(VLOOKUP(A8,祝日など!$D$2:$E$15,2,FALSE),\"\")","v":""},null,null,null,"生命・環境セミナー\n（白石）","生命・環境セミナー\n（白石）"]
["2025-04-08","(火)",{"$f":"IFERROR(VLOOKUP(A9,テーブル1[],2,FALSE),\"\")&IFERROR(VLOOKUP(A9,祝日など!$D$2:$E$15,2,FALSE),\"\")","v":"第1ターム開始"},"有機宇宙地球化学セミナー\n10時～（薮田）","有機宇宙地球化学セミナー\n（薮田）",null,null,"地球外物質セミナー\n（宮原・小池）","地球外物質セミナー\n（宮原・小池）"]
["2025-04-09","(水)",{"$f":"IFERROR(VLOOKUP(A10,テーブル1[],2,FALSE),\"\")&IFERROR(VLOOKUP(A10,祝日など!$D$2:$E$15,2,FALSE),\"\")","v":""},null,null,null,null,"LIRGセミナー\n（柴田・秋澤・DEY・平山）","LIRGセミナー\n（柴田・秋澤・DEY・平山）"]
["2025-04-10","(木)",{"$f":"IFERROR(VLOOKUP(A11,テーブル1[],2,FALSE),\"\")&IFERROR(VLOOKUP(A11,祝日など!$D$2:$E$15,2,FALSE),\"\")","v":""},"PRDセミナー\n（安東・DAS）","内物セミナー\n（須田・中久喜）",null,null,null,"岩石変形セミナー\n（片山・岡﨑）"]
["2025-04-11","(金)",{"$f":"IFERROR(VLOOKUP(A12,テーブル1[],2,FALSE),\"\")&IFERROR(VLOOKUP(A12,祝日など!$D$2:$E$15,2,FALSE),\"\")","v":""}]
["2025-04-12","(土)",{"$f":"IFERROR(VLOOKUP(A13,テーブル1[],2,FALSE),\"\")&IFERROR(VLOOKUP(A13,祝日など!$D$2:$E$15,2,FALSE),\"\")","v":""}]
["2025-04-13","(日)",{"$f":"IFERROR(VLOOKUP(A14,テーブル1[],2,FALSE),\"\")&IFERROR(VLOOKUP(A14,祝日など!$D$2:$E$15,2,FALSE),\"\")","v":""}]
["2025-04-14","(月)",{"$f":"IFERROR(VLOOKUP(A15,テーブル1[],2,FALSE),\"\")&IFERROR(VLOOKUP(A15,祝日など!$D$2:$E$15,2,FALSE),\"\")","v":""},null,null,null,"生命・環境セミナー\n（白石）","生命・環境セミナー\n（白石）"]
["2025-04-15","(火)",{"$f":"IFERROR(VLOOKUP(A16,テーブル1[],2,FALSE),\"\")&IFERROR(VLOOKUP(A16,祝日など!$D$2:$E$15,2,FALSE),\"\")","v":""},"有機宇宙地球化学セミナー\n10時～（薮田）","有機宇宙地球化学セミナー\n（薮田）",null,null,"地球外物質セミナー\n（宮原・小池）","地球外物質セミナー\n（宮原・小池）"]
["2025-04-16","(水)",{"$f":"IFERROR(VLOOKUP(A17,テーブル1[],2,FALSE),\"\")&IFERROR(VLOOKUP(A17,祝日など!$D$2:$E$15,2,FALSE),\"\")","v":""},null,null,null,null,"LIRGセミナー\n（柴田・秋澤・DEY・平山）","LIRGセミナー\n（柴田・秋澤・DEY・平山）"]
["2025-04-17","(木)",{"$f":"IFERROR(VLOOKUP(A18,テーブル1[],2,FALSE),\"\")&IFERROR(VLOOKUP(A18,祝日など!$D$2:$E$15,2,FALSE),\"\")","v":""},"PRDセミナー\n（安東・DAS）","内物セミナー\n（須田・中久喜）",null,null,null,"岩石変形セミナー\n（片山・岡﨑）"]
["2025-04-18","(金)",{"$f":"IFERROR(VLOOKUP(A19,テーブル1[],2,FALSE),\"\")&IFERROR(VLOOKUP(A19,祝日など!$D$2:$E$15,2,FALSE),\"\")","v":""}]
["2025-04-19","(土)",{"$f":"IFERROR(VLOOKUP(A20,テーブル1[],2,FALSE),\"\")&IFERROR(VLOOKUP(A20,祝日など!$D$2:$E$15,2,FALSE),\"\")","v":""}]
["2025-04-20","(日)",{"$f":"IFERROR(VLOOKUP(A21,テーブル1[],2,FALSE),\"\")&IFERROR(VLOOKUP(A21,祝日など!$D$2:$E$15,2,FALSE),\"\")","v":""}]
["2025-04-21","(月)",{"$f":"IFERROR(VLOOKUP(A22,テーブル1[],2,FALSE),\"\")&IFERROR(VLOOKUP(A22,祝日など!$D$2:$E$15,2,FALSE),\"\")","v":""},null,null,null,"生命・環境セミナー\n（白石）","生命・環境セミナー\n（白石）"]
["2025-04-22","(火)",{"$f":"IFERROR(VLOOKUP(A23,テーブル1[],2,FALSE),\"\")&IFERROR(VLOOKUP(A23,祝日など!$D$2:$E$15,2,FALSE),\"\")","v":""},"有機宇宙地球化学セミナー\n10時～（薮田）","有機宇宙地球化学セミナー\n（薮田）",null,null,"地球外物質セミナー\n（宮原・小池）","地球外物質セミナー\n（宮原・小池）"]
["2025-04-23","(水)",{"$f":"IFERROR(VLOOKUP(A24,テーブル1[],2,FALSE),\"\")&IFERROR(VLOOKUP(A24,祝日など!$D$2:$E$15,2,FALSE),\"\")","v":""},null,null,null,null,"LIRGセミナー\n（柴田・秋澤・DEY・平山）","LIRGセミナー\n（柴田・秋澤・DEY・平山）"]
["2025-04-24","(木)",{"$f":"IFERROR(VLOOKUP(A25,テーブル1[],2,FALSE),\"\")&IFERROR(VLOOKUP(A25,祝日など!$D$2:$E$15,2,FALSE),\"\")","v":""},"PRDセミナー\n（安東・DAS）","内物セミナー\n（須田・中久喜）",null,null,null,"岩石変形セミナー\n（片山・岡﨑）"]
["2025-04-25","(金)",{"$f":"IFERROR(VLOOKUP(A26,テーブル1[],2,FALSE),\"\")&IFERROR(VLOOKUP(A26,祝日など!$D$2:$E$15,2,FALSE),\"\")","v":""}]
["2025-04-26","(土)",{"$f":"IFERROR(VLOOKUP(A27,テーブル1[],2,FALSE),\"\")&IFERROR(VLOOKUP(A27,祝日など!$D$2:$E$15,2,FALSE),\"\")","v":""}]
["2025-04-27","(日)",{"$f":"IFERROR(VLOOKUP(A28,テーブル1[],2,FALSE),\"\")&IFERROR(VLOOKUP(A28,祝日など!$D$2:$E$15,2,FALSE),\"\")","v":""}]
["2025-04-28","(月)",{"$f":"IFERROR(VLOOKUP(A29,テーブル1[],2,FALSE),\"\")&IFERROR(VLOOKUP(A29,祝日など!$D$2:$E$15,2,FALSE),\"\")","v":""},null,null,null,"生命・環境セミナー\n（白石）","生命・環境セミナー\n（白石）","教員会"]
["2025-04-29","(火)",{"$f":"IFERROR(VLOOKUP(A30,テーブル1[],2,FALSE),\"\")&IFERROR(VLOOKUP(A30,祝日など!$D$2:$E$15,2,FALSE),\"\")","v":"昭和の日"}]
["2025-04-30","(水)",{"$f":"IFERROR(VLOOKUP(A31,テーブル1[],2,FALSE),\"\")&IFERROR(VLOOKUP(A31,祝日など!$D$2:$E$15,2,FALSE),\"\")","v":""},null,null,null,null,"LIRGセミナー\n（柴田・秋澤・DEY・平山）","LIRGセミナー\n（柴田・秋澤・DEY・平山）"]
["2025-05-01","(木)",{"$f":"IFERROR(VLOOKUP(A32,テーブル1[],2,FALSE),\"\")&IFERROR(VLOOKUP(A32,祝日など!$D$2:$E$15,2,FALSE),\"\")","v":"振替授業(火)"},"有機宇宙地球化学セミナー\n10時～（薮田）","有機宇宙地球化学セミナー\n（薮田）",null,null,"地球外物質セミナー\n（宮原・小池）","地球外物質セミナー\n（宮原・小池）"]
["2025-05-02","(金)",{"$f":"IFERROR(VLOOKUP(A33,テーブル1[],2,FALSE),\"\")&IFERROR(VLOOKUP(A33,祝日など!$D$2:$E$15,2,FALSE),\"\")","v":""}]
["2025-05-03","(土)",{"$f":"IFERROR(VLOOKUP(A34,テーブル1[],2,FALSE),\"\")&IFERROR(VLOOKUP(A34,祝日など!$D$2:$E$15,2,FALSE),\"\")","v":"憲法記念日"}]
["2025-05-04","(日)",{"$f":"IFERROR(VLOOKUP(A35,テーブル1[],2,FALSE),\"\")&IFERROR(VLOOKUP(A35,祝日など!$D$2:$E$15,2,FALSE),\"\")","v":"みどりの日"}]
["2025-05-05","(月)",{"$f":"IFERROR(VLOOKUP(A36,テーブル1[],2,FALSE),\"\")&IFERROR(VLOOKUP(A36,祝日など!$D$2:$E$15,2,FALSE),\"\")","v":"こどもの日"}]
["2025-05-06","(火)",{"$f":"IFERROR(VLOOKUP(A37,テーブル1[],2,FALSE),\"\")&IFERROR(VLOOKUP(A37,祝日など!$D$2:$E$15,2,FALSE),\"\")","v":"振替休日"}]
["2025-05-07","(水)",{"$f":"IFERROR(VLOOKUP(A38,テーブル1[],2,FALSE),\"\")&IFERROR(VLOOKUP(A38,祝日など!$D$2:$E$15,2,FALSE),\"\")","v":"振替授業(月)"},null,null,null,null,"LIRGセミナー\n（柴田・秋澤・DEY・平山）","LIRGセミナー\n（柴田・秋澤・DEY・平山）"]
["2025-05-08","(木)",{"$f":"IFERROR(VLOOKUP(A39,テーブル1[],2,FALSE),\"\")&IFERROR(VLOOKUP(A39,祝日など!$D$2:$E$15,2,FALSE),\"\")","v":""},"PRDセミナー\n（安東・DAS）","内物セミナー\n（須田・中久喜）",null,null,null,"岩石変形セミナー\n（片山・岡﨑）"]
["2025-05-09","(金)",{"$f":"IFERROR(VLOOKUP(A40,テーブル1[],2,FALSE),\"\")&IFERROR(VLOOKUP(A40,祝日など!$D$2:$E$15,2,FALSE),\"\")","v":""}]
["2025-05-10","(土)",{"$f":"IFERROR(VLOOKUP(A41,テーブル1[],2,FALSE),\"\")&IFERROR(VLOOKUP(A41,祝日など!$D$2:$E$15,2,FALSE),\"\")","v":""}]
["2025-05-11","(日)",{"$f":"IFERROR(VLOOKUP(A42,テーブル1[],2,FALSE),\"\")&IFERROR(VLOOKUP(A42,祝日など!$D$2:$E$15,2,FALSE),\"\")","v":""}]
["2025-05-12","(月)",{"$f":"IFERROR(VLOOKUP(A43,テーブル1[],2,FALSE),\"\")&IFERROR(VLOOKUP(A43,祝日など!$D$2:$E$15,2,FALSE),\"\")","v":""},null,null,null,"生命・環境セミナー\n（白石）","生命・環境セミナー\n（白石）"]
["2025-05-13","(火)",{"$f":"IFERROR(VLOOKUP(A44,テーブル1[],2,FALSE),\"\")&IFERROR(VLOOKUP(A44,祝日など!$D$2:$E$15,2,FALSE),\"\")","v":""},"有機宇宙地球化学セミナー\n10時～（薮田）","有機宇宙地球化学セミナー\n（薮田）",null,null,"地球外物質セミナー\n（宮原・小池）","地球外物質セミナー\n（宮原・小池）"]
["2025-05-14","(水)",{"$f":"IFERROR(VLOOKUP(A45,テーブル1[],2,FALSE),\"\")&IFERROR(VLOOKUP(A45,祝日など!$D$2:$E$15,2,FALSE),\"\")","v":""},null,null,null,null,"LIRGセミナー\n（柴田・秋澤・DEY・平山）","LIRGセミナー\n（柴田・秋澤・DEY・平山）"]
["2025-05-15","(木)",{"$f":"IFERROR(VLOOKUP(A46,テーブル1[],2,FALSE),\"\")&IFERROR(VLOOKUP(A46,祝日など!$D$2:$E$15,2,FALSE),\"\")","v":""},"PRDセミナー\n（安東・DAS）","内物セミナー\n（須田・中久喜）",null,null,null,"岩石変形セミナー\n（片山・岡﨑）"]
["2025-05-16","(金)",{"$f":"IFERROR(VLOOKUP(A47,テーブル1[],2,FALSE),\"\")&IFERROR(VLOOKUP(A47,祝日など!$D$2:$E$15,2,FALSE),\"\")","v":""}]
["2025-05-17","(土)",{"$f":"IFERROR(VLOOKUP(A48,テーブル1[],2,FALSE),\"\")&IFERROR(VLOOKUP(A48,祝日など!$D$2:$E$15,2,FALSE),\"\")","v":""}]
["2025-05-18","(日)",{"$f":"IFERROR(VLOOKUP(A49,テーブル1[],2,FALSE),\"\")&IFERROR(VLOOKUP(A49,祝日など!$D$2:$E$15,2,FALSE),\"\")","v":""}]
["2025-05-19","(月)",{"$f":"IFERROR(VLOOKUP(A50,テーブル1[],2,FALSE),\"\")&IFERROR(VLOOKUP(A50,祝日など!$D$2:$E$15,2,FALSE),\"\")","v":""},null,null,null,"生命・環境セミナー\n（白石）","生命・環境セミナー\n（白石）","教員会"]
["2025-05-20","(火)",{"$f":"IFERROR(VLOOKUP(A51,テーブル1[],2,FALSE),\"\")&IFERROR(VLOOKUP(A51,祝日など!$D$2:$E$15,2,FALSE),\"\")","v":""},"有機宇宙地球化学セミナー\n10時～（薮田）","有機宇宙地球化学セミナー\n（薮田）",null,null,"地球外物質セミナー\n（宮原・小池）","地球外物質セミナー\n（宮原・小池）"]
["2025-05-21","(水)",{"$f":"IFERROR(VLOOKUP(A52,テーブル1[],2,FALSE),\"\")&IFERROR(VLOOKUP(A52,祝日など!$D$2:$E$15,2,FALSE),\"\")","v":""},null,null,null,null,"LIRGセミナー\n（柴田・秋澤・DEY・平山）","LIRGセミナー\n（柴田・秋澤・DEY・平山）"]
["2025-05-22","(木)",{"$f":"IFERROR(VLOOKUP(A53,テーブル1[],2,FALSE),\"\")&IFERROR(VLOOKUP(A53,祝日など!$D$2:$E$15,2,FALSE),\"\")","v":""},"PRDセミナー\n（安東・DAS）","内物セミナー\n（須田・中久喜）",null,null,null,"岩石変形セミナー\n（片山・岡﨑）"]
["2025-05-23","(金)",{"$f":"IFERROR(VLOOKUP(A54,テーブル1[],2,FALSE),\"\")&IFERROR(VLOOKUP(A54,祝日など!$D$2:$E$15,2,FALSE),\"\")","v":""}]
["2025-05-24","(土)",{"$f":"IFERROR(VLOOKUP(A55,テーブル1[],2,FALSE),\"\")&IFERROR(VLOOKUP(A55,祝日など!$D$2:$E$15,2,FALSE),\"\")","v":""}]
["2025-05-25","(日)",{"$f":"IFERROR(VLOOKUP(A56,テーブル1[],2,FALSE),\"\")&IFERROR(VLOOKUP(A56,祝日など!$D$2:$E$15,2,FALSE),\"\")","v":""}]
["2025-05-26","(月)",{"$f":"IFERROR(VLOOKUP(A57,テーブル1[],2,FALSE),\"\")&IFERROR(VLOOKUP(A57,祝日など!$D$2:$E$15,2,FALSE),\"\")","v":""},null,null,null,"生命・環境セミナー\n（白石）","生命・環境セミナー\n（白石）"]
["2025-05-27","(火)",{"$f":"IFERROR(VLOOKUP(A58,テーブル1[],2,FALSE),\"\")&IFERROR(VLOOKUP(A58,祝日など!$D$2:$E$15,2,FALSE),\"\")","v":""},"有機宇宙地球化学セミナー\n10時～（薮田）","有機宇宙地球化学セミナー\n（薮田）",null,null,"地球外物質セミナー\n（宮原・小池）","地球外物質セミナー\n（宮原・小池）"]
["2025-05-28","(水)",{"$f":"IFERROR(VLOOKUP(A59,テーブル1[],2,FALSE),\"\")&IFERROR(VLOOKUP(A59,祝日など!$D$2:$E$15,2,FALSE),\"\")","v":""},null,null,null,null,"LIRGセミナー\n（柴田・秋澤・DEY・平山）","LIRGセミナー\n（柴田・秋澤・DEY・平山）"]
["2025-05-29","(木)",{"$f":"IFERROR(VLOOKUP(A60,テーブル1[],2,FALSE),\"\")&IFERROR(VLOOKUP(A60,祝日など!$D$2:$E$15,2,FALSE),\"\")","v":""},"PRDセミナー\n（安東・DAS）","内物セミナー\n（須田・中久喜）",null,null,null,"岩石変形セミナー\n（片山・岡﨑）"]
["2025-05-30","(金)",{"$f":"IFERROR(VLOOKUP(A61,テーブル1[],2,FALSE),\"\")&IFERROR(VLOOKUP(A61,祝日など!$D$2:$E$15,2,FALSE),\"\")","v":""}]
["2025-05-31","(土)",{"$f":"IFERROR(VLOOKUP(A62,テーブル1[],2,FALSE),\"\")&IFERROR(VLOOKUP(A62,祝日など!$D$2:$E$15,2,FALSE),\"\")","v":""}]
["2025-06-01","(日)",{"$f":"IFERROR(VLOOKUP(A63,テーブル1[],2,FALSE),\"\")&IFERROR(VLOOKUP(A63,祝日など!$D$2:$E$15,2,FALSE),\"\")","v":""}]
["2025-06-02","(月)",{"$f":"IFERROR(VLOOKUP(A64,テーブル1[],2,FALSE),\"\")&IFERROR(VLOOKUP(A64,祝日など!$D$2:$E$15,2,FALSE),\"\")","v":""},null,null,null,"生命・環境セミナー\n（白石）","生命・環境セミナー\n（白石）"]
["2025-06-03","(火)",{"$f":"IFERROR(VLOOKUP(A65,テーブル1[],2,FALSE),\"\")&IFERROR(VLOOKUP(A65,祝日など!$D$2:$E$15,2,FALSE),\"\")","v":""},"有機宇宙地球化学セミナー\n10時～（薮田）","有機宇宙地球化学セミナー\n（薮田）",null,null,"地球外物質セミナー\n（宮原・小池）","地球外物質セミナー\n（宮原・小池）"]
["2025-06-04","(水)",{"$f":"IFERROR(VLOOKUP(A66,テーブル1[],2,FALSE),\"\")&IFERROR(VLOOKUP(A66,祝日など!$D$2:$E$15,2,FALSE),\"\")","v":""},null,null,null,null,"LIRGセミナー\n（柴田・秋澤・DEY・平山）","LIRGセミナー\n（柴田・秋澤・DEY・平山）"]
["2025-06-05","(木)",{"$f":"IFERROR(VLOOKUP(A67,テーブル1[],2,FALSE),\"\")&IFERROR(VLOOKUP(A67,祝日など!$D$2:$E$15,2,FALSE),\"\")","v":""},"PRDセミナー\n（安東・DAS）","内物セミナー\n（須田・中久喜）",null,null,null,"岩石変形セミナー\n（片山・岡﨑）"]
["2025-06-06","(金)",{"$f":"IFERROR(VLOOKUP(A68,テーブル1[],2,FALSE),\"\")&IFERROR(VLOOKUP(A68,祝日など!$D$2:$E$15,2,FALSE),\"\")","v":"第2ターム開始"}]
["2025-06-07","(土)",{"$f":"IFERROR(VLOOKUP(A69,テーブル1[],2,FALSE),\"\")&IFERROR(VLOOKUP(A69,祝日など!$D$2:$E$15,2,FALSE),\"\")","v":""}]
["2025-06-08","(日)",{"$f":"IFERROR(VLOOKUP(A70,テーブル1[],2,FALSE),\"\")&IFERROR(VLOOKUP(A70,祝日など!$D$2:$E$15,2,FALSE),\"\")","v":""}]
["2025-06-09","(月)",{"$f":"IFERROR(VLOOKUP(A71,テーブル1[],2,FALSE),\"\")&IFERROR(VLOOKUP(A71,祝日など!$D$2:$E$15,2,FALSE),\"\")","v":""},null,null,null,"生命・環境セミナー\n（白石）","生命・環境セミナー\n（白石）"]
["2025-06-10","(火)",{"$f":"IFERROR(VLOOKUP(A72,テーブル1[],2,FALSE),\"\")&IFERROR(VLOOKUP(A72,祝日など!$D$2:$E$15,2,FALSE),\"\")","v":""},"有機宇宙地球化学セミナー\n10時～（薮田）","有機宇宙地球化学セミナー\n（薮田）",null,null,"地球外物質セミナー\n（宮原・小池）","地球外物質セミナー\n（宮原・小池）"]
["2025-06-11","(水)",{"$f":"IFERROR(VLOOKUP(A73,テーブル1[],2,FALSE),\"\")&IFERROR(VLOOKUP(A73,祝日など!$D$2:$E$15,2,FALSE),\"\")","v":""},null,null,null,null,"LIRGセミナー\n（柴田・秋澤・DEY・平山）","LIRGセミナー\n（柴田・秋澤・DEY・平山）"]
["2025-06-12","(木)",{"$f":"IFERROR(VLOOKUP(A74,テーブル1[],2,FALSE),\"\")&IFERROR(VLOOKUP(A74,祝日など!$D$2:$E$15,2,FALSE),\"\")","v":""},"PRDセミナー\n（安東・DAS）","内物セミナー\n（須田・中久喜）",null,null,null,"岩石変形セミナー\n（片山・岡﨑）"]
["2025-06-13","(金)",{"$f":"IFERROR(VLOOKUP(A75,テーブル1[],2,FALSE),\"\")&IFERROR(VLOOKUP(A75,祝日など!$D$2:$E$15,2,FALSE),\"\")","v":""}]
["2025-06-14","(土)",{"$f":"IFERROR(VLOOKUP(A76,テーブル1[],2,FALSE),\"\")&IFERROR(VLOOKUP(A76,祝日など!$D$2:$E$15,2,FALSE),\"\")","v":""}]
["2025-06-15","(日)",{"$f":"IFERROR(VLOOKUP(A77,テーブル1[],2,FALSE),\"\")&IFERROR(VLOOKUP(A77,祝日など!$D$2:$E$15,2,FALSE),\"\")","v":""}]
["2025-06-16","(月)",{"$f":"IFERROR(VLOOKUP(A78,テーブル1[],2,FALSE),\"\")&IFERROR(VLOOKUP(A78,祝日など!$D$2:$E$15,2,FALSE),\"\")","v":""},null,null,null,"生命・環境セミナー\n（白石）","生命・環境セミナー\n（白石）"]
["2025-06-17","(火)",{"$f":"IFERROR(VLOOKUP(A79,テーブル1[],2,FALSE),\"\")&IFERROR(VLOOKUP(A79,祝日など!$D$2:$E$15,2,FALSE),\"\")","v":""},"有機宇宙地球化学セミナー\n10時～（薮田）","有機宇宙地球化学セミナー\n（薮田）",null,null,"地球外物質セミナー\n（宮原・小池）","地球外物質セミナー\n（宮原・小池）"]
["2025-06-18","(水)",{"$f":"IFERROR(VLOOKUP(A80,テーブル1[],2,FALSE),\"\")&IFERROR(VLOOKUP(A80,祝日など!$D$2:$E$15,2,FALSE),\"\")","v":""},null,null,null,null,"LIRGセミナー\n（柴田・秋澤・DEY・平山）","LIRGセミナー\n（柴田・秋澤・DEY・平山）"]
["2025-06-19","(木)",{"$f":"IFERROR(VLOOKUP(A81,テーブル1[],2,FALSE),\"\")&IFERROR(VLOOKUP(A81,祝日など!$D$2:$E$15,2,FALSE),\"\")","v":""},"PRDセミナー\n（安東・DAS）","内物セミナー\n（須田・中久喜）",null,null,null,"岩石変形セミナー\n（片山・岡﨑）"]
["2025-06-20","(金)",{"$f":"IFERROR(VLOOKUP(A82,テーブル1[],2,FALSE),\"\")&IFERROR(VLOOKUP(A82,祝日など!$D$2:$E$15,2,FALSE),\"\")","v":""}]
["2025-06-21","(土)",{"$f":"IFERROR(VLOOKUP(A83,テーブル1[],2,FALSE),\"\")&IFERROR(VLOOKUP(A83,祝日など!$D$2:$E$15,2,FALSE),\"\")","v":""}]
["2025-06-22","(日)",{"$f":"IFERROR(VLOOKUP(A84,テーブル1[],2,FALSE),\"\")&IFERROR(VLOOKUP(A84,祝日など!$D$2:$E$15,2,FALSE),\"\")","v":""}]
["2025-06-23","(月)",{"$f":"IFERROR(VLOOKUP(A85,テーブル1[],2,FALSE),\"\")&IFERROR(VLOOKUP(A85,祝日など!$D$2:$E$15,2,FALSE),\"\")","v":""},null,null,null,"生命・環境セミナー\n（白石）","生命・環境セミナー\n（白石）"]
["2025-06-24","(火)",{"$f":"IFERROR(VLOOKUP(A86,テーブル1[],2,FALSE),\"\")&IFERROR(VLOOKUP(A86,祝日など!$D$2:$E$15,2,FALSE),\"\")","v":""},"有機宇宙地球化学セミナー\n10時～（薮田）","有機宇宙地球化学セミナー\n（薮田）",null,null,"地球外物質セミナー\n（宮原・小池）","地球外物質セミナー\n（宮原・小池）"]
["2025-06-25","(水)",{"$f":"IFERROR(VLOOKUP(A87,テーブル1[],2,FALSE),\"\")&IFERROR(VLOOKUP(A87,祝日など!$D$2:$E$15,2,FALSE),\"\")","v":""},null,null,null,null,"LIRGセミナー\n（柴田・秋澤・DEY・平山）","LIRGセミナー\n（柴田・秋澤・DEY・平山）"]
["2025-06-26","(木)",{"$f":"IFERROR(VLOOKUP(A88,テーブル1[],2,FALSE),\"\")&IFERROR(VLOOKUP(A88,祝日など!$D$2:$E$15,2,FALSE),\"\")","v":""},"PRDセミナー\n（安東・DAS）","内物セミナー\n（須田・中久喜）",null,null,null,"岩石変形セミナー\n（片山・岡﨑）"]
["2025-06-27","(金)",{"$f":"IFERROR(VLOOKUP(A89,テーブル1[],2,FALSE),\"\")&IFERROR(VLOOKUP(A89,祝日など!$D$2:$E$15,2,FALSE),\"\")","v":""}]
["2025-06-28","(土)",{"$f":"IFERROR(VLOOKUP(A90,テーブル1[],2,FALSE),\"\")&IFERROR(VLOOKUP(A90,祝日など!$D$2:$E$15,2,FALSE),\"\")","v":""}]
["2025-06-29","(日)",{"$f":"IFERROR(VLOOKUP(A91,テーブル1[],2,FALSE),\"\")&IFERROR(VLOOKUP(A91,祝日など!$D$2:$E$15,2,FALSE),\"\")","v":""}]
["2025-06-30","(月)",{"$f":"IFERROR(VLOOKUP(A92,テーブル1[],2,FALSE),\"\")&IFERROR(VLOOKUP(A92,祝日など!$D$2:$E$15,2,FALSE),\"\")","v":""},null,null,null,"生命・環境セミナー\n（白石）","生命・環境セミナー\n（白石）","教員会"]
["2025-07-01","(火)",{"$f":"IFERROR(VLOOKUP(A93,テーブル1[],2,FALSE),\"\")&IFERROR(VLOOKUP(A93,祝日など!$D$2:$E$15,2,FALSE),\"\")","v":""},"有機宇宙地球化学セミナー\n10時～（薮田）","有機宇宙地球化学セミナー\n（薮田）",null,null,"地球外物質セミナー\n（宮原・小池）","地球外物質セミナー\n（宮原・小池）"]
["2025-07-02","(水)",{"$f":"IFERROR(VLOOKUP(A94,テーブル1[],2,FALSE),\"\")&IFERROR(VLOOKUP(A94,祝日など!$D$2:$E$15,2,FALSE),\"\")","v":""},null,null,null,null,"LIRGセミナー\n（柴田・秋澤・DEY・平山）","LIRGセミナー\n（柴田・秋澤・DEY・平山）"]
["2025-07-03","(木)",{"$f":"IFERROR(VLOOKUP(A95,テーブル1[],2,FALSE),\"\")&IFERROR(VLOOKUP(A95,祝日など!$D$2:$E$15,2,FALSE),\"\")","v":""},"PRDセミナー\n（安東・DAS）","内物セミナー\n（須田・中久喜）",null,null,null,"岩石変形セミナー\n（片山・岡﨑）"]
["2025-07-04","(金)",{"$f":"IFERROR(VLOOKUP(A96,テーブル1[],2,FALSE),\"\")&IFERROR(VLOOKUP(A96,祝日など!$D$2:$E$15,2,FALSE),\"\")","v":""}]
["2025-07-05","(土)",{"$f":"IFERROR(VLOOKUP(A97,テーブル1[],2,FALSE),\"\")&IFERROR(VLOOKUP(A97,祝日など!$D$2:$E$15,2,FALSE),\"\")","v":""}]
["2025-07-06","(日)",{"$f":"IFERROR(VLOOKUP(A98,テーブル1[],2,FALSE),\"\")&IFERROR(VLOOKUP(A98,祝日など!$D$2:$E$15,2,FALSE),\"\")","v":""}]
["2025-07-07","(月)",{"$f":"IFERROR(VLOOKUP(A99,テーブル1[],2,FALSE),\"\")&IFERROR(VLOOKUP(A99,祝日など!$D$2:$E$15,2,FALSE),\"\")","v":""},null,null,null,"生命・環境セミナー\n（白石）","生命・環境セミナー\n（白石）","薮田会議"]
["2025-07-08","(火)",{"$f":"IFERROR(VLOOKUP(A100,テーブル1[],2,FALSE),\"\")&IFERROR(VLOOKUP(A100,祝日など!$D$2:$E$15,2,FALSE),\"\")","v":""},"有機宇宙地球化学セミナー\n10時～（薮田）","有機宇宙地球化学セミナー\n（薮田）",null,null,"地球外物質セミナー\n（宮原・小池）","地球外物質セミナー\n（宮原・小池）"]
["2025-07-09","(水)",{"$f":"IFERROR(VLOOKUP(A101,テーブル1[],2,FALSE),\"\")&IFERROR(VLOOKUP(A101,祝日など!$D$2:$E$15,2,FALSE),\"\")","v":""},null,null,null,null,"LIRGセミナー\n（柴田・秋澤・DEY・平山）","LIRGセミナー\n（柴田・秋澤・DEY・平山）"]
["2025-07-10","(木)",{"$f":"IFERROR(VLOOKUP(A102,テーブル1[],2,FALSE),\"\")&IFERROR(VLOOKUP(A102,祝日など!$D$2:$E$15,2,FALSE),\"\")","v":""},"PRDセミナー\n（安東・DAS）","内物セミナー\n（須田・中久喜）",null,null,null,"岩石変形セミナー\n（片山・岡﨑）"]
["2025-07-11","(金)",{"$f":"IFERROR(VLOOKUP(A103,テーブル1[],2,FALSE),\"\")&IFERROR(VLOOKUP(A103,祝日など!$D$2:$E$15,2,FALSE),\"\")","v":""},null,null,null,"鈴村セミナー（秋澤）"]
["2025-07-12","(土)",{"$f":"IFERROR(VLOOKUP(A104,テーブル1[],2,FALSE),\"\")&IFERROR(VLOOKUP(A104,祝日など!$D$2:$E$15,2,FALSE),\"\")","v":""}]
["2025-07-13","(日)",{"$f":"IFERROR(VLOOKUP(A105,テーブル1[],2,FALSE),\"\")&IFERROR(VLOOKUP(A105,祝日など!$D$2:$E$15,2,FALSE),\"\")","v":""}]
["2025-07-14","(月)",{"$f":"IFERROR(VLOOKUP(A106,テーブル1[],2,FALSE),\"\")&IFERROR(VLOOKUP(A106,祝日など!$D$2:$E$15,2,FALSE),\"\")","v":""},null,null,null,"生命・環境セミナー\n（白石）","生命・環境セミナー\n（白石）","←　片山　→"]
["2025-07-15","(火)",{"$f":"IFERROR(VLOOKUP(A107,テーブル1[],2,FALSE),\"\")&IFERROR(VLOOKUP(A107,祝日など!$D$2:$E$15,2,FALSE),\"\")","v":""},"有機宇宙地球化学セミナー\n10時～（薮田）","有機宇宙地球化学セミナー\n（薮田）",null,null,"地球外物質セミナー\n（宮原・小池）","地球外物質セミナー\n（宮原・小池）"]
["2025-07-16","(水)",{"$f":"IFERROR(VLOOKUP(A108,テーブル1[],2,FALSE),\"\")&IFERROR(VLOOKUP(A108,祝日など!$D$2:$E$15,2,FALSE),\"\")","v":""},null,null,null,null,"LIRGセミナー\n（柴田・秋澤・DEY・平山）","LIRGセミナー\n（柴田・秋澤・DEY・平山）"]
["2025-07-17","(木)",{"$f":"IFERROR(VLOOKUP(A109,テーブル1[],2,FALSE),\"\")&IFERROR(VLOOKUP(A109,祝日など!$D$2:$E$15,2,FALSE),\"\")","v":""},"PRDセミナー\n（安東・DAS）","内物セミナー\n（須田・中久喜）",null,null,null,"岩石変形セミナー\n（片山・岡﨑）"]
["2025-07-18","(金)",{"$f":"IFERROR(VLOOKUP(A110,テーブル1[],2,FALSE),\"\")&IFERROR(VLOOKUP(A110,祝日など!$D$2:$E$15,2,FALSE),\"\")","v":"振替授業(月)"},"10時～柴田研","柴田研",null,"生命・環境セミナー\n（白石）","生命・環境セミナー\n（白石）"]
["2025-07-19","(土)",{"$f":"IFERROR(VLOOKUP(A111,テーブル1[],2,FALSE),\"\")&IFERROR(VLOOKUP(A111,祝日など!$D$2:$E$15,2,FALSE),\"\")","v":""}]
["2025-07-20","(日)",{"$f":"IFERROR(VLOOKUP(A112,テーブル1[],2,FALSE),\"\")&IFERROR(VLOOKUP(A112,祝日など!$D$2:$E$15,2,FALSE),\"\")","v":""}]
["2025-07-21","(月)",{"$f":"IFERROR(VLOOKUP(A113,テーブル1[],2,FALSE),\"\")&IFERROR(VLOOKUP(A113,祝日など!$D$2:$E$15,2,FALSE),\"\")","v":"海の日"}]
["2025-07-22","(火)",{"$f":"IFERROR(VLOOKUP(A114,テーブル1[],2,FALSE),\"\")&IFERROR(VLOOKUP(A114,祝日など!$D$2:$E$15,2,FALSE),\"\")","v":""},"有機宇宙地球化学セミナー\n10時～（薮田）","有機宇宙地球化学セミナー\n（薮田）",null,null,"地球外物質セミナー\n（宮原・小池）","地球外物質セミナー\n（宮原・小池）"]
["2025-07-23","(水)",{"$f":"IFERROR(VLOOKUP(A115,テーブル1[],2,FALSE),\"\")&IFERROR(VLOOKUP(A115,祝日など!$D$2:$E$15,2,FALSE),\"\")","v":""},null,null,null,null,"LIRGセミナー\n（柴田・秋澤・DEY・平山）","LIRGセミナー\n（柴田・秋澤・DEY・平山）"]
["2025-07-24","(木)",{"$f":"IFERROR(VLOOKUP(A116,テーブル1[],2,FALSE),\"\")&IFERROR(VLOOKUP(A116,祝日など!$D$2:$E$15,2,FALSE),\"\")","v":""},"PRDセミナー\n（安東・DAS）","内物セミナー\n（須田・中久喜）",null,null,null,"岩石変形セミナー\n（片山・岡﨑）"]
["2025-07-25","(金)",{"$f":"IFERROR(VLOOKUP(A117,テーブル1[],2,FALSE),\"\")&IFERROR(VLOOKUP(A117,祝日など!$D$2:$E$15,2,FALSE),\"\")","v":""}]
["2025-07-26","(土)",{"$f":"IFERROR(VLOOKUP(A118,テーブル1[],2,FALSE),\"\")&IFERROR(VLOOKUP(A118,祝日など!$D$2:$E$15,2,FALSE),\"\")","v":""}]
["2025-07-27","(日)",{"$f":"IFERROR(VLOOKUP(A119,テーブル1[],2,FALSE),\"\")&IFERROR(VLOOKUP(A119,祝日など!$D$2:$E$15,2,FALSE),\"\")","v":""}]
["2025-07-28","(月)",{"$f":"IFERROR(VLOOKUP(A120,テーブル1[],2,FALSE),\"\")&IFERROR(VLOOKUP(A120,祝日など!$D$2:$E$15,2,FALSE),\"\")","v":""},"生命・環境セミナー\n（白石）","生命・環境セミナー\n（白石）",null,null,null,"教員会"]
["2025-07-29","(火)",{"$f":"IFERROR(VLOOKUP(A121,テーブル1[],2,FALSE),\"\")&IFERROR(VLOOKUP(A121,祝日など!$D$2:$E$15,2,FALSE),\"\")","v":""},"有機宇宙地球化学セミナー\n10時～（薮田）","有機宇宙地球化学セミナー\n（薮田）",null,null,"地球外物質セミナー\n（宮原・小池）","地球外物質セミナー\n（宮原・小池）"]
["2025-07-30","(水)",{"$f":"IFERROR(VLOOKUP(A122,テーブル1[],2,FALSE),\"\")&IFERROR(VLOOKUP(A122,祝日など!$D$2:$E$15,2,FALSE),\"\")","v":""},null,null,null,null,"LIRGセミナー\n（柴田・秋澤・DEY・平山）","LIRGセミナー\n（柴田・秋澤・DEY・平山）"]
["2025-07-31","(木)",{"$f":"IFERROR(VLOOKUP(A123,テーブル1[],2,FALSE),\"\")&IFERROR(VLOOKUP(A123,祝日など!$D$2:$E$15,2,FALSE),\"\")","v":""},"PRDセミナー\n（安東・DAS）","内物セミナー\n（須田・中久喜）",null,null,null,"岩石変形セミナー\n（片山・岡﨑）"]
["2025-08-01","(金)",{"$f":"IFERROR(VLOOKUP(A124,テーブル1[],2,FALSE),\"\")&IFERROR(VLOOKUP(A124,祝日など!$D$2:$E$15,2,FALSE),\"\")","v":""}]
["2025-08-02","(土)",{"$f":"IFERROR(VLOOKUP(A125,テーブル1[],2,FALSE),\"\")&IFERROR(VLOOKUP(A125,祝日など!$D$2:$E$15,2,FALSE),\"\")","v":""}]
["2025-08-03","(日)",{"$f":"IFERROR(VLOOKUP(A126,テーブル1[],2,FALSE),\"\")&IFERROR(VLOOKUP(A126,祝日など!$D$2:$E$15,2,FALSE),\"\")","v":""}]
["2025-08-04","(月)",{"$f":"IFERROR(VLOOKUP(A127,テーブル1[],2,FALSE),\"\")&IFERROR(VLOOKUP(A127,祝日など!$D$2:$E$15,2,FALSE),\"\")","v":"夏季休暇開始"}]
["2025-08-05","(火)",{"$f":"IFERROR(VLOOKUP(A128,テーブル1[],2,FALSE),\"\")&IFERROR(VLOOKUP(A128,祝日など!$D$2:$E$15,2,FALSE),\"\")","v":""}]
["2025-08-06","(水)",{"$f":"IFERROR(VLOOKUP(A129,テーブル1[],2,FALSE),\"\")&IFERROR(VLOOKUP(A129,祝日など!$D$2:$E$15,2,FALSE),\"\")","v":""}]
["2025-08-07","(木)",{"$f":"IFERROR(VLOOKUP(A130,テーブル1[],2,FALSE),\"\")&IFERROR(VLOOKUP(A130,祝日など!$D$2:$E$15,2,FALSE),\"\")","v":""}]
["2025-08-08","(金)",{"$f":"IFERROR(VLOOKUP(A131,テーブル1[],2,FALSE),\"\")&IFERROR(VLOOKUP(A131,祝日など!$D$2:$E$15,2,FALSE),\"\")","v":""}]
["2025-08-09","(土)",{"$f":"IFERROR(VLOOKUP(A132,テーブル1[],2,FALSE),\"\")&IFERROR(VLOOKUP(A132,祝日など!$D$2:$E$15,2,FALSE),\"\")","v":""}]
["2025-08-10","(日)",{"$f":"IFERROR(VLOOKUP(A133,テーブル1[],2,FALSE),\"\")&IFERROR(VLOOKUP(A133,祝日など!$D$2:$E$15,2,FALSE),\"\")","v":""}]
["2025-08-11","(月)",{"$f":"IFERROR(VLOOKUP(A134,テーブル1[],2,FALSE),\"\")&IFERROR(VLOOKUP(A134,祝日など!$D$2:$E$15,2,FALSE),\"\")","v":"山の日"}]
["2025-08-12","(火)",{"$f":"IFERROR(VLOOKUP(A135,テーブル1[],2,FALSE),\"\")&IFERROR(VLOOKUP(A135,祝日など!$D$2:$E$15,2,FALSE),\"\")","v":"夏季休業"}]
["2025-08-13","(水)",{"$f":"IFERROR(VLOOKUP(A136,テーブル1[],2,FALSE),\"\")&IFERROR(VLOOKUP(A136,祝日など!$D$2:$E$15,2,FALSE),\"\")","v":"夏季休業"}]
["2025-08-14","(木)",{"$f":"IFERROR(VLOOKUP(A137,テーブル1[],2,FALSE),\"\")&IFERROR(VLOOKUP(A137,祝日など!$D$2:$E$15,2,FALSE),\"\")","v":"夏季休業"}]
["2025-08-15","(金)",{"$f":"IFERROR(VLOOKUP(A138,テーブル1[],2,FALSE),\"\")&IFERROR(VLOOKUP(A138,祝日など!$D$2:$E$15,2,FALSE),\"\")","v":"夏季休業"}]
["2025-08-16","(土)",{"$f":"IFERROR(VLOOKUP(A139,テーブル1[],2,FALSE),\"\")&IFERROR(VLOOKUP(A139,祝日など!$D$2:$E$15,2,FALSE),\"\")","v":""}]
["2025-08-17","(日)",{"$f":"IFERROR(VLOOKUP(A140,テーブル1[],2,FALSE),\"\")&IFERROR(VLOOKUP(A140,祝日など!$D$2:$E$15,2,FALSE),\"\")","v":""}]
["2025-08-18","(月)",{"$f":"IFERROR(VLOOKUP(A141,テーブル1[],2,FALSE),\"\")&IFERROR(VLOOKUP(A141,祝日など!$D$2:$E$15,2,FALSE),\"\")","v":""}]
["2025-08-19","(火)",{"$f":"IFERROR(VLOOKUP(A142,テーブル1[],2,FALSE),\"\")&IFERROR(VLOOKUP(A142,祝日など!$D$2:$E$15,2,FALSE),\"\")","v":""}]
["2025-08-20","(水)",{"$f":"IFERROR(VLOOKUP(A143,テーブル1[],2,FALSE),\"\")&IFERROR(VLOOKUP(A143,祝日など!$D$2:$E$15,2,FALSE),\"\")","v":""}]
["2025-08-21","(木)",{"$f":"IFERROR(VLOOKUP(A144,テーブル1[],2,FALSE),\"\")&IFERROR(VLOOKUP(A144,祝日など!$D$2:$E$15,2,FALSE),\"\")","v":""}]
["2025-08-22","(金)",{"$f":"IFERROR(VLOOKUP(A145,テーブル1[],2,FALSE),\"\")&IFERROR(VLOOKUP(A145,祝日など!$D$2:$E$15,2,FALSE),\"\")","v":""}]
["2025-08-23","(土)",{"$f":"IFERROR(VLOOKUP(A146,テーブル1[],2,FALSE),\"\")&IFERROR(VLOOKUP(A146,祝日など!$D$2:$E$15,2,FALSE),\"\")","v":""}]
["2025-08-24","(日)",{"$f":"IFERROR(VLOOKUP(A147,テーブル1[],2,FALSE),\"\")&IFERROR(VLOOKUP(A147,祝日など!$D$2:$E$15,2,FALSE),\"\")","v":""}]
["2025-08-25","(月)",{"$f":"IFERROR(VLOOKUP(A148,テーブル1[],2,FALSE),\"\")&IFERROR(VLOOKUP(A148,祝日など!$D$2:$E$15,2,FALSE),\"\")","v":""},null,null,null,null,null,"教員会"]
["2025-08-26","(火)",{"$f":"IFERROR(VLOOKUP(A149,テーブル1[],2,FALSE),\"\")&IFERROR(VLOOKUP(A149,祝日など!$D$2:$E$15,2,FALSE),\"\")","v":""},null,null,null,"D論審査（口述試験）"]
["2025-08-27","(水)",{"$f":"IFERROR(VLOOKUP(A150,テーブル1[],2,FALSE),\"\")&IFERROR(VLOOKUP(A150,祝日など!$D$2:$E$15,2,FALSE),\"\")","v":""}]
["2025-08-28","(木)",{"$f":"IFERROR(VLOOKUP(A151,テーブル1[],2,FALSE),\"\")&IFERROR(VLOOKUP(A151,祝日など!$D$2:$E$15,2,FALSE),\"\")","v":""}]
["2025-08-29","(金)",{"$f":"IFERROR(VLOOKUP(A152,テーブル1[],2,FALSE),\"\")&IFERROR(VLOOKUP(A152,祝日など!$D$2:$E$15,2,FALSE),\"\")","v":""}]
["2025-08-30","(土)",{"$f":"IFERROR(VLOOKUP(A153,テーブル1[],2,FALSE),\"\")&IFERROR(VLOOKUP(A153,祝日など!$D$2:$E$15,2,FALSE),\"\")","v":""}]
["2025-08-31","(日)",{"$f":"IFERROR(VLOOKUP(A154,テーブル1[],2,FALSE),\"\")&IFERROR(VLOOKUP(A154,祝日など!$D$2:$E$15,2,FALSE),\"\")","v":""},"全学停電（8：30～18：00）","全学停電（8：30～18：00）","停電","全学停電（8：30～18：00）","全学停電（8：30～18：00）","全学停電（8：30～18：00）"]
["2025-09-01","(月)",{"$f":"IFERROR(VLOOKUP(A155,テーブル1[],2,FALSE),\"\")&IFERROR(VLOOKUP(A155,祝日など!$D$2:$E$15,2,FALSE),\"\")","v":""},"岡﨑セミナー","岡﨑セミナー",null,"岡﨑セミナー","岡﨑セミナー"]
["2025-09-02","(火)",{"$f":"IFERROR(VLOOKUP(A156,テーブル1[],2,FALSE),\"\")&IFERROR(VLOOKUP(A156,祝日など!$D$2:$E$15,2,FALSE),\"\")","v":""}]
["2025-09-03","(水)",{"$f":"IFERROR(VLOOKUP(A157,テーブル1[],2,FALSE),\"\")&IFERROR(VLOOKUP(A157,祝日など!$D$2:$E$15,2,FALSE),\"\")","v":""},"R5年度生面談・控室（須田）","R5年度生面談・控室（須田）",null,"R5年度生面談・控室（須田）","R5年度生面談・控室（須田）","R5年度生面談・控室（須田）"]
["2025-09-04","(木)",{"$f":"IFERROR(VLOOKUP(A158,テーブル1[],2,FALSE),\"\")&IFERROR(VLOOKUP(A158,祝日など!$D$2:$E$15,2,FALSE),\"\")","v":""}]
["2025-09-05","(金)",{"$f":"IFERROR(VLOOKUP(A159,テーブル1[],2,FALSE),\"\")&IFERROR(VLOOKUP(A159,祝日など!$D$2:$E$15,2,FALSE),\"\")","v":""},null,"←　室井　→"]
["2025-09-06","(土)",{"$f":"IFERROR(VLOOKUP(A160,テーブル1[],2,FALSE),\"\")&IFERROR(VLOOKUP(A160,祝日など!$D$2:$E$15,2,FALSE),\"\")","v":""},null,null,null,null,"←　Swarnaa　→","←　DUTTA（17:30-19:00）→"]
["2025-09-07","(日)",{"$f":"IFERROR(VLOOKUP(A161,テーブル1[],2,FALSE),\"\")&IFERROR(VLOOKUP(A161,祝日など!$D$2:$E$15,2,FALSE),\"\")","v":""}]
["2025-09-08","(月)",{"$f":"IFERROR(VLOOKUP(A162,テーブル1[],2,FALSE),\"\")&IFERROR(VLOOKUP(A162,祝日など!$D$2:$E$15,2,FALSE),\"\")","v":""}]
["2025-09-09","(火)",{"$f":"IFERROR(VLOOKUP(A163,テーブル1[],2,FALSE),\"\")&IFERROR(VLOOKUP(A163,祝日など!$D$2:$E$15,2,FALSE),\"\")","v":""}]
["2025-09-10","(水)",{"$f":"IFERROR(VLOOKUP(A164,テーブル1[],2,FALSE),\"\")&IFERROR(VLOOKUP(A164,祝日など!$D$2:$E$15,2,FALSE),\"\")","v":""}]
["2025-09-11","(木)",{"$f":"IFERROR(VLOOKUP(A165,テーブル1[],2,FALSE),\"\")&IFERROR(VLOOKUP(A165,祝日など!$D$2:$E$15,2,FALSE),\"\")","v":""}]
["2025-09-12","(金)",{"$f":"IFERROR(VLOOKUP(A166,テーブル1[],2,FALSE),\"\")&IFERROR(VLOOKUP(A166,祝日など!$D$2:$E$15,2,FALSE),\"\")","v":""}]
["2025-09-13","(土)",{"$f":"IFERROR(VLOOKUP(A167,テーブル1[],2,FALSE),\"\")&IFERROR(VLOOKUP(A167,祝日など!$D$2:$E$15,2,FALSE),\"\")","v":""}]
["2025-09-14","(日)",{"$f":"IFERROR(VLOOKUP(A168,テーブル1[],2,FALSE),\"\")&IFERROR(VLOOKUP(A168,祝日など!$D$2:$E$15,2,FALSE),\"\")","v":""}]
["2025-09-15","(月)",{"$f":"IFERROR(VLOOKUP(A169,テーブル1[],2,FALSE),\"\")&IFERROR(VLOOKUP(A169,祝日など!$D$2:$E$15,2,FALSE),\"\")","v":"敬老の日"}]
["2025-09-16","(火)",{"$f":"IFERROR(VLOOKUP(A170,テーブル1[],2,FALSE),\"\")&IFERROR(VLOOKUP(A170,祝日など!$D$2:$E$15,2,FALSE),\"\")","v":""}]
["2025-09-17","(水)",{"$f":"IFERROR(VLOOKUP(A171,テーブル1[],2,FALSE),\"\")&IFERROR(VLOOKUP(A171,祝日など!$D$2:$E$15,2,FALSE),\"\")","v":""}]
["2025-09-18","(木)",{"$f":"IFERROR(VLOOKUP(A172,テーブル1[],2,FALSE),\"\")&IFERROR(VLOOKUP(A172,祝日など!$D$2:$E$15,2,FALSE),\"\")","v":""}]
["2025-09-19","(金)",{"$f":"IFERROR(VLOOKUP(A173,テーブル1[],2,FALSE),\"\")&IFERROR(VLOOKUP(A173,祝日など!$D$2:$E$15,2,FALSE),\"\")","v":""},"R5年度生面談・控室（須田）","R5年度生面談・控室（須田）",null,"R5年度生面談・控室（須田）","R5年度生面談・控室（須田）","R5年度生面談・控室（須田）"]
["2025-09-20","(土)",{"$f":"IFERROR(VLOOKUP(A174,テーブル1[],2,FALSE),\"\")&IFERROR(VLOOKUP(A174,祝日など!$D$2:$E$15,2,FALSE),\"\")","v":""}]
["2025-09-21","(日)",{"$f":"IFERROR(VLOOKUP(A175,テーブル1[],2,FALSE),\"\")&IFERROR(VLOOKUP(A175,祝日など!$D$2:$E$15,2,FALSE),\"\")","v":""}]
["2025-09-22","(月)",{"$f":"IFERROR(VLOOKUP(A176,テーブル1[],2,FALSE),\"\")&IFERROR(VLOOKUP(A176,祝日など!$D$2:$E$15,2,FALSE),\"\")","v":""}]
["2025-09-23","(火)",{"$f":"IFERROR(VLOOKUP(A177,テーブル1[],2,FALSE),\"\")&IFERROR(VLOOKUP(A177,祝日など!$D$2:$E$15,2,FALSE),\"\")","v":"秋分の日"}]
["2025-09-24","(水)",{"$f":"IFERROR(VLOOKUP(A178,テーブル1[],2,FALSE),\"\")&IFERROR(VLOOKUP(A178,祝日など!$D$2:$E$15,2,FALSE),\"\")","v":""}]
["2025-09-25","(木)",{"$f":"IFERROR(VLOOKUP(A179,テーブル1[],2,FALSE),\"\")&IFERROR(VLOOKUP(A179,祝日など!$D$2:$E$15,2,FALSE),\"\")","v":""}]
["2025-09-26","(金)",{"$f":"IFERROR(VLOOKUP(A180,テーブル1[],2,FALSE),\"\")&IFERROR(VLOOKUP(A180,祝日など!$D$2:$E$15,2,FALSE),\"\")","v":""},"R5年度生面談・控室（須田）","R5年度生面談・控室（須田）",null,"R5年度生面談・控室（須田）","R5年度生面談・控室（須田）","R5年度生面談・控室（須田）"]
["2025-09-27","(土)",{"$f":"IFERROR(VLOOKUP(A181,テーブル1[],2,FALSE),\"\")&IFERROR(VLOOKUP(A181,祝日など!$D$2:$E$15,2,FALSE),\"\")","v":""}]
["2025-09-28","(日)",{"$f":"IFERROR(VLOOKUP(A182,テーブル1[],2,FALSE),\"\")&IFERROR(VLOOKUP(A182,祝日など!$D$2:$E$15,2,FALSE),\"\")","v":""}]
["2025-09-29","(月)",{"$f":"IFERROR(VLOOKUP(A183,テーブル1[],2,FALSE),\"\")&IFERROR(VLOOKUP(A183,祝日など!$D$2:$E$15,2,FALSE),\"\")","v":""},null,null,null,null,null,"教員会"]
["2025-09-30","(火)",{"$f":"IFERROR(VLOOKUP(A184,テーブル1[],2,FALSE),\"\")&IFERROR(VLOOKUP(A184,祝日など!$D$2:$E$15,2,FALSE),\"\")","v":""}]
["2025-10-01","(水)",{"$f":"IFERROR(VLOOKUP(A185,テーブル1[],2,FALSE),\"\")&IFERROR(VLOOKUP(A185,祝日など!$D$2:$E$15,2,FALSE),\"\")","v":""}]
["2025-10-02","(木)",{"$f":"IFERROR(VLOOKUP(A186,テーブル1[],2,FALSE),\"\")&IFERROR(VLOOKUP(A186,祝日など!$D$2:$E$15,2,FALSE),\"\")","v":"第3ターム開始"},null,null,null,null,"内物セミナー\n（須田・中久喜）","岩石変形セミナー\n（片山・岡﨑）"]
["2025-10-03","(金)",{"$f":"IFERROR(VLOOKUP(A187,テーブル1[],2,FALSE),\"\")&IFERROR(VLOOKUP(A187,祝日など!$D$2:$E$15,2,FALSE),\"\")","v":""},"生命・環境セミナー（白石）","生命・環境セミナー（白石）",null,"地球外物質セミナー\n（宮原・小池）"]
["2025-10-04","(土)",{"$f":"IFERROR(VLOOKUP(A188,テーブル1[],2,FALSE),\"\")&IFERROR(VLOOKUP(A188,祝日など!$D$2:$E$15,2,FALSE),\"\")","v":""}]
["2025-10-05","(日)",{"$f":"IFERROR(VLOOKUP(A189,テーブル1[],2,FALSE),\"\")&IFERROR(VLOOKUP(A189,祝日など!$D$2:$E$15,2,FALSE),\"\")","v":""}]
["2025-10-06","(月)",{"$f":"IFERROR(VLOOKUP(A190,テーブル1[],2,FALSE),\"\")&IFERROR(VLOOKUP(A190,祝日など!$D$2:$E$15,2,FALSE),\"\")","v":""}]
["2025-10-07","(火)",{"$f":"IFERROR(VLOOKUP(A191,テーブル1[],2,FALSE),\"\")&IFERROR(VLOOKUP(A191,祝日など!$D$2:$E$15,2,FALSE),\"\")","v":""},"有機宇宙地球化学セミナー\n10時～（薮田）","有機宇宙地球化学セミナー\n（薮田）"]
["2025-10-08","(水)",{"$f":"IFERROR(VLOOKUP(A192,テーブル1[],2,FALSE),\"\")&IFERROR(VLOOKUP(A192,祝日など!$D$2:$E$15,2,FALSE),\"\")","v":""},null,null,null,null,"LIRGセミナー\n（柴田・秋澤・平山）","LIRGセミナー\n（柴田・秋澤・平山）"]
["2025-10-09","(木)",{"$f":"IFERROR(VLOOKUP(A193,テーブル1[],2,FALSE),\"\")&IFERROR(VLOOKUP(A193,祝日など!$D$2:$E$15,2,FALSE),\"\")","v":""},null,null,null,null,"内物セミナー\n（須田・中久喜）","岩石変形セミナー\n（片山・岡﨑）"]
["2025-10-10","(金)",{"$f":"IFERROR(VLOOKUP(A194,テーブル1[],2,FALSE),\"\")&IFERROR(VLOOKUP(A194,祝日など!$D$2:$E$15,2,FALSE),\"\")","v":""},"生命・環境セミナー（白石）","生命・環境セミナー（白石）",null,"地球外物質セミナー\n（宮原・小池）"]
["2025-10-11","(土)",{"$f":"IFERROR(VLOOKUP(A195,テーブル1[],2,FALSE),\"\")&IFERROR(VLOOKUP(A195,祝日など!$D$2:$E$15,2,FALSE),\"\")","v":""}]
["2025-10-12","(日)",{"$f":"IFERROR(VLOOKUP(A196,テーブル1[],2,FALSE),\"\")&IFERROR(VLOOKUP(A196,祝日など!$D$2:$E$15,2,FALSE),\"\")","v":""}]
["2025-10-13","(月)",{"$f":"IFERROR(VLOOKUP(A197,テーブル1[],2,FALSE),\"\")&IFERROR(VLOOKUP(A197,祝日など!$D$2:$E$15,2,FALSE),\"\")","v":"スポーツの日"}]
["2025-10-14","(火)",{"$f":"IFERROR(VLOOKUP(A198,テーブル1[],2,FALSE),\"\")&IFERROR(VLOOKUP(A198,祝日など!$D$2:$E$15,2,FALSE),\"\")","v":""},"有機宇宙地球化学セミナー\n10時～（薮田）","有機宇宙地球化学セミナー\n（薮田）"]
["2025-10-15","(水)",{"$f":"IFERROR(VLOOKUP(A199,テーブル1[],2,FALSE),\"\")&IFERROR(VLOOKUP(A199,祝日など!$D$2:$E$15,2,FALSE),\"\")","v":""},null,null,null,null,"LIRGセミナー\n（柴田・秋澤・平山）","LIRGセミナー\n（柴田・秋澤・平山）"]
["2025-10-16","(木)",{"$f":"IFERROR(VLOOKUP(A200,テーブル1[],2,FALSE),\"\")&IFERROR(VLOOKUP(A200,祝日など!$D$2:$E$15,2,FALSE),\"\")","v":"振替授業(月)"}]
["2025-10-17","(金)",{"$f":"IFERROR(VLOOKUP(A201,テーブル1[],2,FALSE),\"\")&IFERROR(VLOOKUP(A201,祝日など!$D$2:$E$15,2,FALSE),\"\")","v":""},"生命・環境セミナー（白石）","生命・環境セミナー（白石）",null,"地球外物質セミナー\n（宮原・小池）"]
["2025-10-18","(土)",{"$f":"IFERROR(VLOOKUP(A202,テーブル1[],2,FALSE),\"\")&IFERROR(VLOOKUP(A202,祝日など!$D$2:$E$15,2,FALSE),\"\")","v":""}]
["2025-10-19","(日)",{"$f":"IFERROR(VLOOKUP(A203,テーブル1[],2,FALSE),\"\")&IFERROR(VLOOKUP(A203,祝日など!$D$2:$E$15,2,FALSE),\"\")","v":""}]
["2025-10-20","(月)",{"$f":"IFERROR(VLOOKUP(A204,テーブル1[],2,FALSE),\"\")&IFERROR(VLOOKUP(A204,祝日など!$D$2:$E$15,2,FALSE),\"\")","v":""},null,null,null,null,null,"教員会"]
["2025-10-21","(火)",{"$f":"IFERROR(VLOOKUP(A205,テーブル1[],2,FALSE),\"\")&IFERROR(VLOOKUP(A205,祝日など!$D$2:$E$15,2,FALSE),\"\")","v":""},"有機宇宙地球化学セミナー\n10時～（薮田）","有機宇宙地球化学セミナー\n（薮田）"]
["2025-10-22","(水)",{"$f":"IFERROR(VLOOKUP(A206,テーブル1[],2,FALSE),\"\")&IFERROR(VLOOKUP(A206,祝日など!$D$2:$E$15,2,FALSE),\"\")","v":""},null,null,null,null,"LIRGセミナー\n（柴田・秋澤・平山）","LIRGセミナー\n（柴田・秋澤・平山）"]
["2025-10-23","(木)",{"$f":"IFERROR(VLOOKUP(A207,テーブル1[],2,FALSE),\"\")&IFERROR(VLOOKUP(A207,祝日など!$D$2:$E$15,2,FALSE),\"\")","v":""},null,null,null,null,"内物セミナー\n（須田・中久喜）","岩石変形セミナー\n（片山・岡﨑）"]
["2025-10-24","(金)",{"$f":"IFERROR(VLOOKUP(A208,テーブル1[],2,FALSE),\"\")&IFERROR(VLOOKUP(A208,祝日など!$D$2:$E$15,2,FALSE),\"\")","v":""},"生命・環境セミナー（白石）","生命・環境セミナー（白石）"]
["2025-10-25","(土)",{"$f":"IFERROR(VLOOKUP(A209,テーブル1[],2,FALSE),\"\")&IFERROR(VLOOKUP(A209,祝日など!$D$2:$E$15,2,FALSE),\"\")","v":""}]
["2025-10-26","(日)",{"$f":"IFERROR(VLOOKUP(A210,テーブル1[],2,FALSE),\"\")&IFERROR(VLOOKUP(A210,祝日など!$D$2:$E$15,2,FALSE),\"\")","v":""}]
["2025-10-27","(月)",{"$f":"IFERROR(VLOOKUP(A211,テーブル1[],2,FALSE),\"\")&IFERROR(VLOOKUP(A211,祝日など!$D$2:$E$15,2,FALSE),\"\")","v":""}]
["2025-10-28","(火)",{"$f":"IFERROR(VLOOKUP(A212,テーブル1[],2,FALSE),\"\")&IFERROR(VLOOKUP(A212,祝日など!$D$2:$E$15,2,FALSE),\"\")","v":""},"有機宇宙地球化学セミナー\n10時～（薮田）","有機宇宙地球化学セミナー\n（薮田）"]
["2025-10-29","(水)",{"$f":"IFERROR(VLOOKUP(A213,テーブル1[],2,FALSE),\"\")&IFERROR(VLOOKUP(A213,祝日など!$D$2:$E$15,2,FALSE),\"\")","v":""},null,null,null,null,"LIRGセミナー\n（柴田・秋澤・平山）","LIRGセミナー\n（柴田・秋澤・平山）"]
["2025-10-30","(木)",{"$f":"IFERROR(VLOOKUP(A214,テーブル1[],2,FALSE),\"\")&IFERROR(VLOOKUP(A214,祝日など!$D$2:$E$15,2,FALSE),\"\")","v":""},null,null,null,null,"内物セミナー\n（須田・中久喜）","岩石変形セミナー\n（片山・岡﨑）"]
["2025-10-31","(金)",{"$f":"IFERROR(VLOOKUP(A215,テーブル1[],2,FALSE),\"\")&IFERROR(VLOOKUP(A215,祝日など!$D$2:$E$15,2,FALSE),\"\")","v":""},"生命・環境セミナー（白石）","生命・環境セミナー（白石）",null,"地球外物質セミナー\n（宮原・小池）"]
["2025-11-01","(土)",{"$f":"IFERROR(VLOOKUP(A216,テーブル1[],2,FALSE),\"\")&IFERROR(VLOOKUP(A216,祝日など!$D$2:$E$15,2,FALSE),\"\")","v":""}]
["2025-11-02","(日)",{"$f":"IFERROR(VLOOKUP(A217,テーブル1[],2,FALSE),\"\")&IFERROR(VLOOKUP(A217,祝日など!$D$2:$E$15,2,FALSE),\"\")","v":""}]
["2025-11-03","(月)",{"$f":"IFERROR(VLOOKUP(A218,テーブル1[],2,FALSE),\"\")&IFERROR(VLOOKUP(A218,祝日など!$D$2:$E$15,2,FALSE),\"\")","v":"文化の日"}]
["2025-11-04","(火)",{"$f":"IFERROR(VLOOKUP(A219,テーブル1[],2,FALSE),\"\")&IFERROR(VLOOKUP(A219,祝日など!$D$2:$E$15,2,FALSE),\"\")","v":""},"有機宇宙地球化学セミナー\n10時～（薮田）","有機宇宙地球化学セミナー\n（薮田）"]
["2025-11-05","(水)",{"$f":"IFERROR(VLOOKUP(A220,テーブル1[],2,FALSE),\"\")&IFERROR(VLOOKUP(A220,祝日など!$D$2:$E$15,2,FALSE),\"\")","v":""},null,null,null,null,"LIRGセミナー\n（柴田・秋澤・平山）","LIRGセミナー\n（柴田・秋澤・平山）"]
["2025-11-06","(木)",{"$f":"IFERROR(VLOOKUP(A221,テーブル1[],2,FALSE),\"\")&IFERROR(VLOOKUP(A221,祝日など!$D$2:$E$15,2,FALSE),\"\")","v":""},null,null,null,null,"内物セミナー\n（須田・中久喜）","岩石変形セミナー\n（片山・岡﨑）"]
["2025-11-07","(金)",{"$f":"IFERROR(VLOOKUP(A222,テーブル1[],2,FALSE),\"\")&IFERROR(VLOOKUP(A222,祝日など!$D$2:$E$15,2,FALSE),\"\")","v":"振替授業(月)"}]
["2025-11-08","(土)",{"$f":"IFERROR(VLOOKUP(A223,テーブル1[],2,FALSE),\"\")&IFERROR(VLOOKUP(A223,祝日など!$D$2:$E$15,2,FALSE),\"\")","v":""}]
["2025-11-09","(日)",{"$f":"IFERROR(VLOOKUP(A224,テーブル1[],2,FALSE),\"\")&IFERROR(VLOOKUP(A224,祝日など!$D$2:$E$15,2,FALSE),\"\")","v":""}]
["2025-11-10","(月)",{"$f":"IFERROR(VLOOKUP(A225,テーブル1[],2,FALSE),\"\")&IFERROR(VLOOKUP(A225,祝日など!$D$2:$E$15,2,FALSE),\"\")","v":""}]
["2025-11-11","(火)",{"$f":"IFERROR(VLOOKUP(A226,テーブル1[],2,FALSE),\"\")&IFERROR(VLOOKUP(A226,祝日など!$D$2:$E$15,2,FALSE),\"\")","v":""},"有機宇宙地球化学セミナー\n10時～（薮田）","有機宇宙地球化学セミナー\n（薮田）"]
["2025-11-12","(水)",{"$f":"IFERROR(VLOOKUP(A227,テーブル1[],2,FALSE),\"\")&IFERROR(VLOOKUP(A227,祝日など!$D$2:$E$15,2,FALSE),\"\")","v":""},null,null,null,null,"LIRGセミナー\n（柴田・秋澤・平山）","LIRGセミナー\n（柴田・秋澤・平山）"]
["2025-11-13","(木)",{"$f":"IFERROR(VLOOKUP(A228,テーブル1[],2,FALSE),\"\")&IFERROR(VLOOKUP(A228,祝日など!$D$2:$E$15,2,FALSE),\"\")","v":""},null,null,null,null,"内物セミナー\n（須田・中久喜）","岩石変形セミナー\n（片山・岡﨑）"]
["2025-11-14","(金)",{"$f":"IFERROR(VLOOKUP(A229,テーブル1[],2,FALSE),\"\")&IFERROR(VLOOKUP(A229,祝日など!$D$2:$E$15,2,FALSE),\"\")","v":""},"生命・環境セミナー（白石）","生命・環境セミナー（白石）",null,"地球外物質セミナー\n（宮原・小池）"]
["2025-11-15","(土)",{"$f":"IFERROR(VLOOKUP(A230,テーブル1[],2,FALSE),\"\")&IFERROR(VLOOKUP(A230,祝日など!$D$2:$E$15,2,FALSE),\"\")","v":""}]
["2025-11-16","(日)",{"$f":"IFERROR(VLOOKUP(A231,テーブル1[],2,FALSE),\"\")&IFERROR(VLOOKUP(A231,祝日など!$D$2:$E$15,2,FALSE),\"\")","v":""}]
["2025-11-17","(月)",{"$f":"IFERROR(VLOOKUP(A232,テーブル1[],2,FALSE),\"\")&IFERROR(VLOOKUP(A232,祝日など!$D$2:$E$15,2,FALSE),\"\")","v":""},null,null,null,null,null,"教員会"]
["2025-11-18","(火)",{"$f":"IFERROR(VLOOKUP(A233,テーブル1[],2,FALSE),\"\")&IFERROR(VLOOKUP(A233,祝日など!$D$2:$E$15,2,FALSE),\"\")","v":""},"有機宇宙地球化学セミナー\n10時～（薮田）","有機宇宙地球化学セミナー\n（薮田）"]
["2025-11-19","(水)",{"$f":"IFERROR(VLOOKUP(A234,テーブル1[],2,FALSE),\"\")&IFERROR(VLOOKUP(A234,祝日など!$D$2:$E$15,2,FALSE),\"\")","v":""},null,null,null,null,"LIRGセミナー\n（柴田・秋澤・平山）","LIRGセミナー\n（柴田・秋澤・平山）"]
["2025-11-20","(木)",{"$f":"IFERROR(VLOOKUP(A235,テーブル1[],2,FALSE),\"\")&IFERROR(VLOOKUP(A235,祝日など!$D$2:$E$15,2,FALSE),\"\")","v":""},null,null,null,null,"内物セミナー\n（須田・中久喜）","岩石変形セミナー\n（片山・岡﨑）"]
["2025-11-21","(金)",{"$f":"IFERROR(VLOOKUP(A236,テーブル1[],2,FALSE),\"\")&IFERROR(VLOOKUP(A236,祝日など!$D$2:$E$15,2,FALSE),\"\")","v":""},"生命・環境セミナー（白石）","生命・環境セミナー（白石）",null,"地球外物質セミナー\n（宮原・小池）"]
["2025-11-22","(土)",{"$f":"IFERROR(VLOOKUP(A237,テーブル1[],2,FALSE),\"\")&IFERROR(VLOOKUP(A237,祝日など!$D$2:$E$15,2,FALSE),\"\")","v":""}]
["2025-11-23","(日)",{"$f":"IFERROR(VLOOKUP(A238,テーブル1[],2,FALSE),\"\")&IFERROR(VLOOKUP(A238,祝日など!$D$2:$E$15,2,FALSE),\"\")","v":"勤労感謝の日"}]
["2025-11-24","(月)",{"$f":"IFERROR(VLOOKUP(A239,テーブル1[],2,FALSE),\"\")&IFERROR(VLOOKUP(A239,祝日など!$D$2:$E$15,2,FALSE),\"\")","v":"振替休日"}]
["2025-11-25","(火)",{"$f":"IFERROR(VLOOKUP(A240,テーブル1[],2,FALSE),\"\")&IFERROR(VLOOKUP(A240,祝日など!$D$2:$E$15,2,FALSE),\"\")","v":""},"有機宇宙地球化学セミナー\n10時～（薮田）","有機宇宙地球化学セミナー\n（薮田）"]
["2025-11-26","(水)",{"$f":"IFERROR(VLOOKUP(A241,テーブル1[],2,FALSE),\"\")&IFERROR(VLOOKUP(A241,祝日など!$D$2:$E$15,2,FALSE),\"\")","v":""},null,null,null,null,"LIRGセミナー\n（柴田・秋澤・平山）","LIRGセミナー\n（柴田・秋澤・平山）"]
["2025-11-27","(木)",{"$f":"IFERROR(VLOOKUP(A242,テーブル1[],2,FALSE),\"\")&IFERROR(VLOOKUP(A242,祝日など!$D$2:$E$15,2,FALSE),\"\")","v":""},null,null,null,null,"内物セミナー\n（須田・中久喜）","岩石変形セミナー\n（片山・岡﨑）"]
["2025-11-28","(金)",{"$f":"IFERROR(VLOOKUP(A243,テーブル1[],2,FALSE),\"\")&IFERROR(VLOOKUP(A243,祝日など!$D$2:$E$15,2,FALSE),\"\")","v":""},"生命・環境セミナー（白石）","生命・環境セミナー（白石）",null,"地球外物質セミナー\n（宮原・小池）"]
["2025-11-29","(土)",{"$f":"IFERROR(VLOOKUP(A244,テーブル1[],2,FALSE),\"\")&IFERROR(VLOOKUP(A244,祝日など!$D$2:$E$15,2,FALSE),\"\")","v":""}]
["2025-11-30","(日)",{"$f":"IFERROR(VLOOKUP(A245,テーブル1[],2,FALSE),\"\")&IFERROR(VLOOKUP(A245,祝日など!$D$2:$E$15,2,FALSE),\"\")","v":""}]
["2025-12-01","(月)",{"$f":"IFERROR(VLOOKUP(A246,テーブル1[],2,FALSE),\"\")&IFERROR(VLOOKUP(A246,祝日など!$D$2:$E$15,2,FALSE),\"\")","v":""}]
["2025-12-02","(火)",{"$f":"IFERROR(VLOOKUP(A247,テーブル1[],2,FALSE),\"\")&IFERROR(VLOOKUP(A247,祝日など!$D$2:$E$15,2,FALSE),\"\")","v":"第4ターム開始"},"有機宇宙地球化学セミナー\n10時～（薮田）","有機宇宙地球化学セミナー\n（薮田）"]
["2025-12-03","(水)",{"$f":"IFERROR(VLOOKUP(A248,テーブル1[],2,FALSE),\"\")&IFERROR(VLOOKUP(A248,祝日など!$D$2:$E$15,2,FALSE),\"\")","v":""},null,null,null,null,"LIRGセミナー\n（柴田・秋澤・平山）","LIRGセミナー\n（柴田・秋澤・平山）"]
["2025-12-04","(木)",{"$f":"IFERROR(VLOOKUP(A249,テーブル1[],2,FALSE),\"\")&IFERROR(VLOOKUP(A249,祝日など!$D$2:$E$15,2,FALSE),\"\")","v":""},null,null,null,null,"内物セミナー\n（須田・中久喜）","岩石変形セミナー\n（片山・岡﨑）"]
["2025-12-05","(金)",{"$f":"IFERROR(VLOOKUP(A250,テーブル1[],2,FALSE),\"\")&IFERROR(VLOOKUP(A250,祝日など!$D$2:$E$15,2,FALSE),\"\")","v":""},"生命・環境セミナー（白石）","生命・環境セミナー（白石）",null,"地球外物質セミナー\n（宮原・小池）"]
["2025-12-06","(土)",{"$f":"IFERROR(VLOOKUP(A251,テーブル1[],2,FALSE),\"\")&IFERROR(VLOOKUP(A251,祝日など!$D$2:$E$15,2,FALSE),\"\")","v":""}]
["2025-12-07","(日)",{"$f":"IFERROR(VLOOKUP(A252,テーブル1[],2,FALSE),\"\")&IFERROR(VLOOKUP(A252,祝日など!$D$2:$E$15,2,FALSE),\"\")","v":""}]
["2025-12-08","(月)",{"$f":"IFERROR(VLOOKUP(A253,テーブル1[],2,FALSE),\"\")&IFERROR(VLOOKUP(A253,祝日など!$D$2:$E$15,2,FALSE),\"\")","v":""}]
["2025-12-09","(火)",{"$f":"IFERROR(VLOOKUP(A254,テーブル1[],2,FALSE),\"\")&IFERROR(VLOOKUP(A254,祝日など!$D$2:$E$15,2,FALSE),\"\")","v":""},"有機宇宙地球化学セミナー\n10時～（薮田）","有機宇宙地球化学セミナー\n（薮田）"]
["2025-12-10","(水)",{"$f":"IFERROR(VLOOKUP(A255,テーブル1[],2,FALSE),\"\")&IFERROR(VLOOKUP(A255,祝日など!$D$2:$E$15,2,FALSE),\"\")","v":""},null,null,null,null,"LIRGセミナー\n（柴田・秋澤・平山）","LIRGセミナー\n（柴田・秋澤・平山）"]
["2025-12-11","(木)",{"$f":"IFERROR(VLOOKUP(A256,テーブル1[],2,FALSE),\"\")&IFERROR(VLOOKUP(A256,祝日など!$D$2:$E$15,2,FALSE),\"\")","v":""},null,null,null,null,"内物セミナー\n（須田・中久喜）","岩石変形セミナー\n（片山・岡﨑）"]
["2025-12-12","(金)",{"$f":"IFERROR(VLOOKUP(A257,テーブル1[],2,FALSE),\"\")&IFERROR(VLOOKUP(A257,祝日など!$D$2:$E$15,2,FALSE),\"\")","v":""},"生命・環境セミナー（白石）","生命・環境セミナー（白石）",null,"地球外物質セミナー\n（宮原・小池）","㈱コベルコ科研 会社説明会"]
["2025-12-13","(土)",{"$f":"IFERROR(VLOOKUP(A258,テーブル1[],2,FALSE),\"\")&IFERROR(VLOOKUP(A258,祝日など!$D$2:$E$15,2,FALSE),\"\")","v":""}]
["2025-12-14","(日)",{"$f":"IFERROR(VLOOKUP(A259,テーブル1[],2,FALSE),\"\")&IFERROR(VLOOKUP(A259,祝日など!$D$2:$E$15,2,FALSE),\"\")","v":""}]
["2025-12-15","(月)",{"$f":"IFERROR(VLOOKUP(A260,テーブル1[],2,FALSE),\"\")&IFERROR(VLOOKUP(A260,祝日など!$D$2:$E$15,2,FALSE),\"\")","v":""}]
["2025-12-16","(火)",{"$f":"IFERROR(VLOOKUP(A261,テーブル1[],2,FALSE),\"\")&IFERROR(VLOOKUP(A261,祝日など!$D$2:$E$15,2,FALSE),\"\")","v":""},"有機宇宙地球化学セミナー\n10時～（薮田）","有機宇宙地球化学セミナー\n（薮田）"]
["2025-12-17","(水)",{"$f":"IFERROR(VLOOKUP(A262,テーブル1[],2,FALSE),\"\")&IFERROR(VLOOKUP(A262,祝日など!$D$2:$E$15,2,FALSE),\"\")","v":""},null,null,null,null,"LIRGセミナー\n（柴田・秋澤・平山）","LIRGセミナー\n（柴田・秋澤・平山）"]
["2025-12-18","(木)",{"$f":"IFERROR(VLOOKUP(A263,テーブル1[],2,FALSE),\"\")&IFERROR(VLOOKUP(A263,祝日など!$D$2:$E$15,2,FALSE),\"\")","v":""},null,null,null,null,"内物セミナー\n（須田・中久喜）","岩石変形セミナー\n（片山・岡﨑）"]
["2025-12-19","(金)",{"$f":"IFERROR(VLOOKUP(A264,テーブル1[],2,FALSE),\"\")&IFERROR(VLOOKUP(A264,祝日など!$D$2:$E$15,2,FALSE),\"\")","v":""},null,null,null,"地球外物質セミナー\n（宮原・小池）"]
["2025-12-20","(土)",{"$f":"IFERROR(VLOOKUP(A265,テーブル1[],2,FALSE),\"\")&IFERROR(VLOOKUP(A265,祝日など!$D$2:$E$15,2,FALSE),\"\")","v":""},"改修用停電","改修用停電","停電","改修用停電","改修用停電","改修用停電"]
["2025-12-21","(日)",{"$f":"IFERROR(VLOOKUP(A266,テーブル1[],2,FALSE),\"\")&IFERROR(VLOOKUP(A266,祝日など!$D$2:$E$15,2,FALSE),\"\")","v":""},"改修用停電","改修用停電","停電","改修用停電","改修用停電","改修用停電"]
["2025-12-22","(月)",{"$f":"IFERROR(VLOOKUP(A267,テーブル1[],2,FALSE),\"\")&IFERROR(VLOOKUP(A267,祝日など!$D$2:$E$15,2,FALSE),\"\")","v":""},null,null,null,null,null,"教員会"]
["2025-12-23","(火)",{"$f":"IFERROR(VLOOKUP(A268,テーブル1[],2,FALSE),\"\")&IFERROR(VLOOKUP(A268,祝日など!$D$2:$E$15,2,FALSE),\"\")","v":""},"有機宇宙地球化学セミナー\n10時～（薮田）","有機宇宙地球化学セミナー\n（薮田）"]
["2025-12-24","(水)",{"$f":"IFERROR(VLOOKUP(A269,テーブル1[],2,FALSE),\"\")&IFERROR(VLOOKUP(A269,祝日など!$D$2:$E$15,2,FALSE),\"\")","v":""},null,null,null,null,"LIRGセミナー\n（柴田・秋澤・平山）","LIRGセミナー\n（柴田・秋澤・平山）"]
["2025-12-25","(木)",{"$f":"IFERROR(VLOOKUP(A270,テーブル1[],2,FALSE),\"\")&IFERROR(VLOOKUP(A270,祝日など!$D$2:$E$15,2,FALSE),\"\")","v":"振替授業(金)"},"生命・環境セミナー（白石）","生命・環境セミナー（白石）",null,"地球外物質セミナー\n（宮原・小池）"]
["2025-12-26","(金)",{"$f":"IFERROR(VLOOKUP(A271,テーブル1[],2,FALSE),\"\")&IFERROR(VLOOKUP(A271,祝日など!$D$2:$E$15,2,FALSE),\"\")","v":""},"生命・環境セミナー（白石）","生命・環境セミナー（白石）",null,"地球外物質セミナー\n（宮原・小池）"]
["2025-12-27","(土)",{"$f":"IFERROR(VLOOKUP(A272,テーブル1[],2,FALSE),\"\")&IFERROR(VLOOKUP(A272,祝日など!$D$2:$E$15,2,FALSE),\"\")","v":""}]
["2025-12-28","(日)",{"$f":"IFERROR(VLOOKUP(A273,テーブル1[],2,FALSE),\"\")&IFERROR(VLOOKUP(A273,祝日など!$D$2:$E$15,2,FALSE),\"\")","v":""}]
["2025-12-29","(月)",{"$f":"IFERROR(VLOOKUP(A274,テーブル1[],2,FALSE),\"\")&IFERROR(VLOOKUP(A274,祝日など!$D$2:$E$15,2,FALSE),\"\")","v":"冬季休業"}]
["2025-12-30","(火)",{"$f":"IFERROR(VLOOKUP(A275,テーブル1[],2,FALSE),\"\")&IFERROR(VLOOKUP(A275,祝日など!$D$2:$E$15,2,FALSE),\"\")","v":"冬季休業"}]
["2025-12-31","(水)",{"$f":"IFERROR(VLOOKUP(A276,テーブル1[],2,FALSE),\"\")&IFERROR(VLOOKUP(A276,祝日など!$D$2:$E$15,2,FALSE),\"\")","v":"冬季休業"}]
["2026-01-01","(木)",{"$f":"IFERROR(VLOOKUP(A277,テーブル1[],2,FALSE),\"\")&IFERROR(VLOOKUP(A277,祝日など!$D$2:$E$15,2,FALSE),\"\")","v":"元日"}]
["2026-01-02","(金)",{"$f":"IFERROR(VLOOKUP(A278,テーブル1[],2,FALSE),\"\")&IFERROR(VLOOKUP(A278,祝日など!$D$2:$E$15,2,FALSE),\"\")","v":"休日"}]
["2026-01-03","(土)",{"$f":"IFERROR(VLOOKUP(A279,テーブル1[],2,FALSE),\"\")&IFERROR(VLOOKUP(A279,祝日など!$D$2:$E$15,2,FALSE),\"\")","v":"休日"}]
["2026-01-04","(日)",{"$f":"IFERROR(VLOOKUP(A280,テーブル1[],2,FALSE),\"\")&IFERROR(VLOOKUP(A280,祝日など!$D$2:$E$15,2,FALSE),\"\")","v":""}]
["2026-01-05","(月)",{"$f":"IFERROR(VLOOKUP(A281,テーブル1[],2,FALSE),\"\")&IFERROR(VLOOKUP(A281,祝日など!$D$2:$E$15,2,FALSE),\"\")","v":""}]
["2026-01-06","(火)",{"$f":"IFERROR(VLOOKUP(A282,テーブル1[],2,FALSE),\"\")&IFERROR(VLOOKUP(A282,祝日など!$D$2:$E$15,2,FALSE),\"\")","v":"振替授業(月)"}]
["2026-01-07","(水)",{"$f":"IFERROR(VLOOKUP(A283,テーブル1[],2,FALSE),\"\")&IFERROR(VLOOKUP(A283,祝日など!$D$2:$E$15,2,FALSE),\"\")","v":""},null,null,null,null,"LIRGセミナー\n（柴田・秋澤・平山）","LIRGセミナー\n（柴田・秋澤・平山）"]
["2026-01-08","(木)",{"$f":"IFERROR(VLOOKUP(A284,テーブル1[],2,FALSE),\"\")&IFERROR(VLOOKUP(A284,祝日など!$D$2:$E$15,2,FALSE),\"\")","v":""},null,null,null,null,"内物セミナー\n（須田・中久喜）","岩石変形セミナー\n（片山・岡﨑）"]
["2026-01-09","(金)",{"$f":"IFERROR(VLOOKUP(A285,テーブル1[],2,FALSE),\"\")&IFERROR(VLOOKUP(A285,祝日など!$D$2:$E$15,2,FALSE),\"\")","v":""},"生命・環境セミナー（白石）","生命・環境セミナー（白石）",null,"地球外物質セミナー\n（宮原・小池）"]
["2026-01-10","(土)",{"$f":"IFERROR(VLOOKUP(A286,テーブル1[],2,FALSE),\"\")&IFERROR(VLOOKUP(A286,祝日など!$D$2:$E$15,2,FALSE),\"\")","v":""}]
["2026-01-11","(日)",{"$f":"IFERROR(VLOOKUP(A287,テーブル1[],2,FALSE),\"\")&IFERROR(VLOOKUP(A287,祝日など!$D$2:$E$15,2,FALSE),\"\")","v":""}]
["2026-01-12","(月)",{"$f":"IFERROR(VLOOKUP(A288,テーブル1[],2,FALSE),\"\")&IFERROR(VLOOKUP(A288,祝日など!$D$2:$E$15,2,FALSE),\"\")","v":"成人の日"}]
["2026-01-13","(火)",{"$f":"IFERROR(VLOOKUP(A289,テーブル1[],2,FALSE),\"\")&IFERROR(VLOOKUP(A289,祝日など!$D$2:$E$15,2,FALSE),\"\")","v":""},"有機宇宙地球化学セミナー\n10時～（薮田）","有機宇宙地球化学セミナー\n（薮田）"]
["2026-01-14","(水)",{"$f":"IFERROR(VLOOKUP(A290,テーブル1[],2,FALSE),\"\")&IFERROR(VLOOKUP(A290,祝日など!$D$2:$E$15,2,FALSE),\"\")","v":"振替授業(月)"}]
["2026-01-15","(木)",{"$f":"IFERROR(VLOOKUP(A291,テーブル1[],2,FALSE),\"\")&IFERROR(VLOOKUP(A291,祝日など!$D$2:$E$15,2,FALSE),\"\")","v":""},null,null,null,null,"内物セミナー\n（須田・中久喜）","岩石変形セミナー\n（片山・岡﨑）"]
["2026-01-16","(金)",{"$f":"IFERROR(VLOOKUP(A292,テーブル1[],2,FALSE),\"\")&IFERROR(VLOOKUP(A292,祝日など!$D$2:$E$15,2,FALSE),\"\")","v":""},"生命・環境セミナー（白石）","生命・環境セミナー（白石）",null,"地球外物質セミナー\n（宮原・小池）"]
["2026-01-17","(土)",{"$f":"IFERROR(VLOOKUP(A293,テーブル1[],2,FALSE),\"\")&IFERROR(VLOOKUP(A293,祝日など!$D$2:$E$15,2,FALSE),\"\")","v":""}]
["2026-01-18","(日)",{"$f":"IFERROR(VLOOKUP(A294,テーブル1[],2,FALSE),\"\")&IFERROR(VLOOKUP(A294,祝日など!$D$2:$E$15,2,FALSE),\"\")","v":""}]
["2026-01-19","(月)",{"$f":"IFERROR(VLOOKUP(A295,テーブル1[],2,FALSE),\"\")&IFERROR(VLOOKUP(A295,祝日など!$D$2:$E$15,2,FALSE),\"\")","v":""}]
["2026-01-20","(火)",{"$f":"IFERROR(VLOOKUP(A296,テーブル1[],2,FALSE),\"\")&IFERROR(VLOOKUP(A296,祝日など!$D$2:$E$15,2,FALSE),\"\")","v":""},"有機宇宙地球化学セミナー\n10時～（薮田）","有機宇宙地球化学セミナー\n（薮田）"]
["2026-01-21","(水)",{"$f":"IFERROR(VLOOKUP(A297,テーブル1[],2,FALSE),\"\")&IFERROR(VLOOKUP(A297,祝日など!$D$2:$E$15,2,FALSE),\"\")","v":""},null,null,null,null,"LIRGセミナー\n（柴田・秋澤・平山）","LIRGセミナー\n（柴田・秋澤・平山）"]
["2026-01-22","(木)",{"$f":"IFERROR(VLOOKUP(A298,テーブル1[],2,FALSE),\"\")&IFERROR(VLOOKUP(A298,祝日など!$D$2:$E$15,2,FALSE),\"\")","v":""},null,null,null,null,"内物セミナー\n（須田・中久喜）","岩石変形セミナー\n（片山・岡﨑）"]
["2026-01-23","(金)",{"$f":"IFERROR(VLOOKUP(A299,テーブル1[],2,FALSE),\"\")&IFERROR(VLOOKUP(A299,祝日など!$D$2:$E$15,2,FALSE),\"\")","v":""},"生命・環境セミナー（白石）","生命・環境セミナー（白石）",null,"地球外物質セミナー\n（宮原・小池）"]
["2026-01-24","(土)",{"$f":"IFERROR(VLOOKUP(A300,テーブル1[],2,FALSE),\"\")&IFERROR(VLOOKUP(A300,祝日など!$D$2:$E$15,2,FALSE),\"\")","v":""}]
["2026-01-25","(日)",{"$f":"IFERROR(VLOOKUP(A301,テーブル1[],2,FALSE),\"\")&IFERROR(VLOOKUP(A301,祝日など!$D$2:$E$15,2,FALSE),\"\")","v":""}]
["2026-01-26","(月)",{"$f":"IFERROR(VLOOKUP(A302,テーブル1[],2,FALSE),\"\")&IFERROR(VLOOKUP(A302,祝日など!$D$2:$E$15,2,FALSE),\"\")","v":""},null,null,null,null,null,"教員会"]
["2026-01-27","(火)",{"$f":"IFERROR(VLOOKUP(A303,テーブル1[],2,FALSE),\"\")&IFERROR(VLOOKUP(A303,祝日など!$D$2:$E$15,2,FALSE),\"\")","v":""},"有機宇宙地球化学セミナー\n10時～（薮田）","有機宇宙地球化学セミナー\n（薮田）"]
["2026-01-28","(水)",{"$f":"IFERROR(VLOOKUP(A304,テーブル1[],2,FALSE),\"\")&IFERROR(VLOOKUP(A304,祝日など!$D$2:$E$15,2,FALSE),\"\")","v":""}]
["2026-01-29","(木)",{"$f":"IFERROR(VLOOKUP(A305,テーブル1[],2,FALSE),\"\")&IFERROR(VLOOKUP(A305,祝日など!$D$2:$E$15,2,FALSE),\"\")","v":""},null,null,null,null,"内物セミナー\n（須田・中久喜）","岩石変形セミナー\n（片山・岡﨑）"]
["2026-01-30","(金)",{"$f":"IFERROR(VLOOKUP(A306,テーブル1[],2,FALSE),\"\")&IFERROR(VLOOKUP(A306,祝日など!$D$2:$E$15,2,FALSE),\"\")","v":""},"生命・環境セミナー（白石）","生命・環境セミナー（白石）",null,"地球外物質セミナー\n（宮原・小池）"]
["2026-01-31","(土)",{"$f":"IFERROR(VLOOKUP(A307,テーブル1[],2,FALSE),\"\")&IFERROR(VLOOKUP(A307,祝日など!$D$2:$E$15,2,FALSE),\"\")","v":""}]
["2026-02-01","(日)",{"$f":"IFERROR(VLOOKUP(A308,テーブル1[],2,FALSE),\"\")&IFERROR(VLOOKUP(A308,祝日など!$D$2:$E$15,2,FALSE),\"\")","v":""}]
["2026-02-02","(月)",{"$f":"IFERROR(VLOOKUP(A309,テーブル1[],2,FALSE),\"\")&IFERROR(VLOOKUP(A309,祝日など!$D$2:$E$15,2,FALSE),\"\")","v":""}]
["2026-02-03","(火)",{"$f":"IFERROR(VLOOKUP(A310,テーブル1[],2,FALSE),\"\")&IFERROR(VLOOKUP(A310,祝日など!$D$2:$E$15,2,FALSE),\"\")","v":""},"有機宇宙地球化学セミナー\n10時～（薮田）","有機宇宙地球化学セミナー\n（薮田）"]
["2026-02-04","(水)",{"$f":"IFERROR(VLOOKUP(A311,テーブル1[],2,FALSE),\"\")&IFERROR(VLOOKUP(A311,祝日など!$D$2:$E$15,2,FALSE),\"\")","v":""},null,null,null,null,"LIRGセミナー\n（柴田・秋澤・平山）","LIRGセミナー\n（柴田・秋澤・平山）"]
["2026-02-05","(木)",{"$f":"IFERROR(VLOOKUP(A312,テーブル1[],2,FALSE),\"\")&IFERROR(VLOOKUP(A312,祝日など!$D$2:$E$15,2,FALSE),\"\")","v":""},null,null,null,null,"内物セミナー\n（須田・中久喜）","岩石変形セミナー\n（片山・岡﨑）"]
["2026-02-06","(金)",{"$f":"IFERROR(VLOOKUP(A313,テーブル1[],2,FALSE),\"\")&IFERROR(VLOOKUP(A313,祝日など!$D$2:$E$15,2,FALSE),\"\")","v":""},"生命・環境セミナー（白石）","生命・環境セミナー（白石）",null,"地球外物質セミナー\n（宮原・小池）"]
["2026-02-07","(土)",{"$f":"IFERROR(VLOOKUP(A314,テーブル1[],2,FALSE),\"\")&IFERROR(VLOOKUP(A314,祝日など!$D$2:$E$15,2,FALSE),\"\")","v":""}]
["2026-02-08","(日)",{"$f":"IFERROR(VLOOKUP(A315,テーブル1[],2,FALSE),\"\")&IFERROR(VLOOKUP(A315,祝日など!$D$2:$E$15,2,FALSE),\"\")","v":""}]
["2026-02-09","(月)",{"$f":"IFERROR(VLOOKUP(A316,テーブル1[],2,FALSE),\"\")&IFERROR(VLOOKUP(A316,祝日など!$D$2:$E$15,2,FALSE),\"\")","v":"冬季休暇開始"}]
["2026-02-10","(火)",{"$f":"IFERROR(VLOOKUP(A317,テーブル1[],2,FALSE),\"\")&IFERROR(VLOOKUP(A317,祝日など!$D$2:$E$15,2,FALSE),\"\")","v":""}]
["2026-02-11","(水)",{"$f":"IFERROR(VLOOKUP(A318,テーブル1[],2,FALSE),\"\")&IFERROR(VLOOKUP(A318,祝日など!$D$2:$E$15,2,FALSE),\"\")","v":"建国記念の日"}]
["2026-02-12","(木)",{"$f":"IFERROR(VLOOKUP(A319,テーブル1[],2,FALSE),\"\")&IFERROR(VLOOKUP(A319,祝日など!$D$2:$E$15,2,FALSE),\"\")","v":""},"D入試","D入試","D入試","D入試","D入試","D入試"]
["2026-02-13","(金)",{"$f":"IFERROR(VLOOKUP(A320,テーブル1[],2,FALSE),\"\")&IFERROR(VLOOKUP(A320,祝日など!$D$2:$E$15,2,FALSE),\"\")","v":""},"懇談会","懇談会","懇談会","懇談会","懇談会","懇談会"]
["2026-02-14","(土)",{"$f":"IFERROR(VLOOKUP(A321,テーブル1[],2,FALSE),\"\")&IFERROR(VLOOKUP(A321,祝日など!$D$2:$E$15,2,FALSE),\"\")","v":""}]
["2026-02-15","(日)",{"$f":"IFERROR(VLOOKUP(A322,テーブル1[],2,FALSE),\"\")&IFERROR(VLOOKUP(A322,祝日など!$D$2:$E$15,2,FALSE),\"\")","v":""}]
["2026-02-16","(月)",{"$f":"IFERROR(VLOOKUP(A323,テーブル1[],2,FALSE),\"\")&IFERROR(VLOOKUP(A323,祝日など!$D$2:$E$15,2,FALSE),\"\")","v":""},null,null,null,null,null,"教員会"]
["2026-02-17","(火)",{"$f":"IFERROR(VLOOKUP(A324,テーブル1[],2,FALSE),\"\")&IFERROR(VLOOKUP(A324,祝日など!$D$2:$E$15,2,FALSE),\"\")","v":""}]
["2026-02-18","(水)",{"$f":"IFERROR(VLOOKUP(A325,テーブル1[],2,FALSE),\"\")&IFERROR(VLOOKUP(A325,祝日など!$D$2:$E$15,2,FALSE),\"\")","v":""}]
["2026-02-19","(木)",{"$f":"IFERROR(VLOOKUP(A326,テーブル1[],2,FALSE),\"\")&IFERROR(VLOOKUP(A326,祝日など!$D$2:$E$15,2,FALSE),\"\")","v":""}]
["2026-02-20","(金)",{"$f":"IFERROR(VLOOKUP(A327,テーブル1[],2,FALSE),\"\")&IFERROR(VLOOKUP(A327,祝日など!$D$2:$E$15,2,FALSE),\"\")","v":""}]
["2026-02-21","(土)",{"$f":"IFERROR(VLOOKUP(A328,テーブル1[],2,FALSE),\"\")&IFERROR(VLOOKUP(A328,祝日など!$D$2:$E$15,2,FALSE),\"\")","v":""}]
["2026-02-22","(日)",{"$f":"IFERROR(VLOOKUP(A329,テーブル1[],2,FALSE),\"\")&IFERROR(VLOOKUP(A329,祝日など!$D$2:$E$15,2,FALSE),\"\")","v":""}]
["2026-02-23","(月)",{"$f":"IFERROR(VLOOKUP(A330,テーブル1[],2,FALSE),\"\")&IFERROR(VLOOKUP(A330,祝日など!$D$2:$E$15,2,FALSE),\"\")","v":"天皇誕生日"}]
["2026-02-24","(火)",{"$f":"IFERROR(VLOOKUP(A331,テーブル1[],2,FALSE),\"\")&IFERROR(VLOOKUP(A331,祝日など!$D$2:$E$15,2,FALSE),\"\")","v":""}]
["2026-02-25","(水)",{"$f":"IFERROR(VLOOKUP(A332,テーブル1[],2,FALSE),\"\")&IFERROR(VLOOKUP(A332,祝日など!$D$2:$E$15,2,FALSE),\"\")","v":""}]
["2026-02-26","(木)",{"$f":"IFERROR(VLOOKUP(A333,テーブル1[],2,FALSE),\"\")&IFERROR(VLOOKUP(A333,祝日など!$D$2:$E$15,2,FALSE),\"\")","v":""}]
["2026-02-27","(金)",{"$f":"IFERROR(VLOOKUP(A334,テーブル1[],2,FALSE),\"\")&IFERROR(VLOOKUP(A334,祝日など!$D$2:$E$15,2,FALSE),\"\")","v":""}]
["2026-02-28","(土)",{"$f":"IFERROR(VLOOKUP(A335,テーブル1[],2,FALSE),\"\")&IFERROR(VLOOKUP(A335,祝日など!$D$2:$E$15,2,FALSE),\"\")","v":""}]
["2026-03-01","(日)",{"$f":"IFERROR(VLOOKUP(A336,テーブル1[],2,FALSE),\"\")&IFERROR(VLOOKUP(A336,祝日など!$D$2:$E$15,2,FALSE),\"\")","v":""}]
["2026-03-02","(月)",{"$f":"IFERROR(VLOOKUP(A337,テーブル1[],2,FALSE),\"\")&IFERROR(VLOOKUP(A337,祝日など!$D$2:$E$15,2,FALSE),\"\")","v":""}]
["2026-03-03","(火)",{"$f":"IFERROR(VLOOKUP(A338,テーブル1[],2,FALSE),\"\")&IFERROR(VLOOKUP(A338,祝日など!$D$2:$E$15,2,FALSE),\"\")","v":""}]
["2026-03-04","(水)",{"$f":"IFERROR(VLOOKUP(A339,テーブル1[],2,FALSE),\"\")&IFERROR(VLOOKUP(A339,祝日など!$D$2:$E$15,2,FALSE),\"\")","v":""}]
["2026-03-05","(木)",{"$f":"IFERROR(VLOOKUP(A340,テーブル1[],2,FALSE),\"\")&IFERROR(VLOOKUP(A340,祝日など!$D$2:$E$15,2,FALSE),\"\")","v":""}]
["2026-03-06","(金)",{"$f":"IFERROR(VLOOKUP(A341,テーブル1[],2,FALSE),\"\")&IFERROR(VLOOKUP(A341,祝日など!$D$2:$E$15,2,FALSE),\"\")","v":""}]
["2026-03-07","(土)",{"$f":"IFERROR(VLOOKUP(A342,テーブル1[],2,FALSE),\"\")&IFERROR(VLOOKUP(A342,祝日など!$D$2:$E$15,2,FALSE),\"\")","v":""}]
["2026-03-08","(日)",{"$f":"IFERROR(VLOOKUP(A343,テーブル1[],2,FALSE),\"\")&IFERROR(VLOOKUP(A343,祝日など!$D$2:$E$15,2,FALSE),\"\")","v":""}]
["2026-03-09","(月)",{"$f":"IFERROR(VLOOKUP(A344,テーブル1[],2,FALSE),\"\")&IFERROR(VLOOKUP(A344,祝日など!$D$2:$E$15,2,FALSE),\"\")","v":""}]
["2026-03-10","(火)",{"$f":"IFERROR(VLOOKUP(A345,テーブル1[],2,FALSE),\"\")&IFERROR(VLOOKUP(A345,祝日など!$D$2:$E$15,2,FALSE),\"\")","v":""}]
["2026-03-11","(水)",{"$f":"IFERROR(VLOOKUP(A346,テーブル1[],2,FALSE),\"\")&IFERROR(VLOOKUP(A346,祝日など!$D$2:$E$15,2,FALSE),\"\")","v":""}]
["2026-03-12","(木)",{"$f":"IFERROR(VLOOKUP(A347,テーブル1[],2,FALSE),\"\")&IFERROR(VLOOKUP(A347,祝日など!$D$2:$E$15,2,FALSE),\"\")","v":""}]
["2026-03-13","(金)",{"$f":"IFERROR(VLOOKUP(A348,テーブル1[],2,FALSE),\"\")&IFERROR(VLOOKUP(A348,祝日など!$D$2:$E$15,2,FALSE),\"\")","v":""}]
["2026-03-14","(土)",{"$f":"IFERROR(VLOOKUP(A349,テーブル1[],2,FALSE),\"\")&IFERROR(VLOOKUP(A349,祝日など!$D$2:$E$15,2,FALSE),\"\")","v":""}]
["2026-03-15","(日)",{"$f":"IFERROR(VLOOKUP(A350,テーブル1[],2,FALSE),\"\")&IFERROR(VLOOKUP(A350,祝日など!$D$2:$E$15,2,FALSE),\"\")","v":""}]
["2026-03-16","(月)",{"$f":"IFERROR(VLOOKUP(A351,テーブル1[],2,FALSE),\"\")&IFERROR(VLOOKUP(A351,祝日など!$D$2:$E$15,2,FALSE),\"\")","v":""}]
["2026-03-17","(火)",{"$f":"IFERROR(VLOOKUP(A352,テーブル1[],2,FALSE),\"\")&IFERROR(VLOOKUP(A352,祝日など!$D$2:$E$15,2,FALSE),\"\")","v":""}]
["2026-03-18","(水)",{"$f":"IFERROR(VLOOKUP(A353,テーブル1[],2,FALSE),\"\")&IFERROR(VLOOKUP(A353,祝日など!$D$2:$E$15,2,FALSE),\"\")","v":""}]
["2026-03-19","(木)",{"$f":"IFERROR(VLOOKUP(A354,テーブル1[],2,FALSE),\"\")&IFERROR(VLOOKUP(A354,祝日など!$D$2:$E$15,2,FALSE),\"\")","v":""}]
["2026-03-20","(金)",{"$f":"IFERROR(VLOOKUP(A355,テーブル1[],2,FALSE),\"\")&IFERROR(VLOOKUP(A355,祝日など!$D$2:$E$15,2,FALSE),\"\")","v":"春分の日"}]
["2026-03-21","(土)",{"$f":"IFERROR(VLOOKUP(A356,テーブル1[],2,FALSE),\"\")&IFERROR(VLOOKUP(A356,祝日など!$D$2:$E$15,2,FALSE),\"\")","v":""}]
["2026-03-22","(日)",{"$f":"IFERROR(VLOOKUP(A357,テーブル1[],2,FALSE),\"\")&IFERROR(VLOOKUP(A357,祝日など!$D$2:$E$15,2,FALSE),\"\")","v":""}]
["2026-03-23","(月)",{"$f":"IFERROR(VLOOKUP(A358,テーブル1[],2,FALSE),\"\")&IFERROR(VLOOKUP(A358,祝日など!$D$2:$E$15,2,FALSE),\"\")","v":""}]
["2026-03-24","(火)",{"$f":"IFERROR(VLOOKUP(A359,テーブル1[],2,FALSE),\"\")&IFERROR(VLOOKUP(A359,祝日など!$D$2:$E$15,2,FALSE),\"\")","v":""}]
["2026-03-25","(水)",{"$f":"IFERROR(VLOOKUP(A360,テーブル1[],2,FALSE),\"\")&IFERROR(VLOOKUP(A360,祝日など!$D$2:$E$15,2,FALSE),\"\")","v":""}]
["2026-03-26","(木)",{"$f":"IFERROR(VLOOKUP(A361,テーブル1[],2,FALSE),\"\")&IFERROR(VLOOKUP(A361,祝日など!$D$2:$E$15,2,FALSE),\"\")","v":""}]
["2026-03-27","(金)",{"$f":"IFERROR(VLOOKUP(A362,テーブル1[],2,FALSE),\"\")&IFERROR(VLOOKUP(A362,祝日など!$D$2:$E$15,2,FALSE),\"\")","v":""}]
["2026-03-28","(土)",{"$f":"IFERROR(VLOOKUP(A363,テーブル1[],2,FALSE),\"\")&IFERROR(VLOOKUP(A363,祝日など!$D$2:$E$15,2,FALSE),\"\")","v":""}]
["2026-03-29","(日)",{"$f":"IFERROR(VLOOKUP(A364,テーブル1[],2,FALSE),\"\")&IFERROR(VLOOKUP(A364,祝日など!$D$2:$E$15,2,FALSE),\"\")","v":""}]
["2026-03-30","(月)",{"$f":"IFERROR(VLOOKUP(A365,テーブル1[],2,FALSE),\"\")&IFERROR(VLOOKUP(A365,祝日など!$D$2:$E$15,2,FALSE),\"\")","v":""},null,null,null,null,null,"教員会"]
["2026-03-31","(火)",{"$f":"IFERROR(VLOOKUP(A366,テーブル1[],2,FALSE),\"\")&IFERROR(VLOOKUP(A366,祝日など!$D$2:$E$15,2,FALSE),\"\")","v":""}]