{"text_format":"1","workbook":"xlsx","n_sheets":9,"sheets":["カレンダー (A705)","祝日など","9-10時限","7-8時限","5-6時限","昼休憩","3-4時限","1-2時限","セミナー"],"not_rendered":{"charts":0,"images":0,"macros":1,"external_links":0,"defined_names":0,"comments":0,"pivot_tables":0},"unopened":[],"bounds":{"document_bytes":16777216,"sheet_cells":100000,"rows_first":2000,"rows_last":500,"rows_between":2000,"halvings":0,"cell_chars":16384,"cell_head_chars":4096},"cells_cut":0,"cells_raw":0,"read":"whole","date_system":"1900"}

{"sheet":"カレンダー (A705)","index":0,"n_rows":35,"n_cols":10,"rows_kept":35,"cut":false,"hidden":false,"merged":[[0,4,0,9],[1,4,1,8],[2,6,3,6],[4,0,4,1],[5,0,5,1],[6,0,6,1],[7,0,7,1],[8,0,8,1],[9,0,9,1],[10,0,10,1],[11,0,11,1],[12,0,12,1],[13,0,13,1],[14,0,14,1],[15,0,15,1],[16,0,16,1],[17,0,17,1],[18,0,18,1],[19,0,19,1],[20,0,20,1],[21,0,21,1],[22,0,22,1],[23,0,23,1],[24,0,24,1],[25,0,25,1],[26,0,26,1],[32,0,32,1],[33,0,33,1],[34,0,34,1],[27,0,27,1],[28,0,28,1],[29,0,29,1],[30,0,30,1],[31,0,31,1]]}
[{"$f":"B2","v":"2026-05-01"},null,"年",null,"A705号室（講義室/顕微鏡実習室）"]
[null,"2026-05-01","月",null,"※予定を入れる/変更する場合は，地事務までご連絡ください。",null,null,null,null,"（収容人数：31名）"]
[null,null,"時限",null,"１・２","３・４","昼休憩","５・６","７・８","９・１０"]
[null,null,"日","曜日","08:45-10:15","10:30-12:00",null,"12:50-14:20","14:35-16:05","16:20-17:50"]
[{"$f":"IFERROR(VLOOKUP(C5,祝日など!$A$2:$B$88,2,FALSE),\"\")&IFERROR(VLOOKUP(C5,祝日など!$D$2:$E$39,2,FALSE),\"\")","v":"振替授業(水)"},null,{"$f":"B2","v":"2026-05-01"},{"$f":"C5","v":46143},{"$f":"IFERROR(VLOOKUP(C5,テーブル4[],2,0),\"\")","v":""},{"$f":"IFERROR(VLOOKUP(C5,テーブル5[],2,FALSE),\"\")","v":""},{"$f":"IFERROR(VLOOKUP(C5,テーブル83[],2,FALSE),\"\")","v":""},{"$f":"IFERROR(VLOOKUP(C5,テーブル6[],2,FALSE),\"\")","v":""},{"$f":"IFERROR(VLOOKUP(C5,テーブル7[],2,FALSE),\"\")","v":"結晶光学演習\n（川添）"},{"$f":"IFERROR(VLOOKUP(C5,テーブル8[],2,FALSE),\"\")","v":""}]
[{"$f":"IFERROR(VLOOKUP(C6,祝日など!$A$2:$B$88,2,FALSE),\"\")&IFERROR(VLOOKUP(C6,祝日など!$D$2:$E$39,2,FALSE),\"\")","v":""},null,{"$f":"C5+1","v":"2026-05-02"},{"$f":"C6","v":46144},{"$f":"IFERROR(VLOOKUP(C6,テーブル4[],2,0),\"\")","v":""},{"$f":"IFERROR(VLOOKUP(C6,テーブル5[],2,FALSE),\"\")","v":""},{"$f":"IFERROR(VLOOKUP(C6,テーブル83[],2,FALSE),\"\")","v":""},{"$f":"IFERROR(VLOOKUP(C6,テーブル6[],2,FALSE),\"\")","v":""},{"$f":"IFERROR(VLOOKUP(C6,テーブル7[],2,FALSE),\"\")","v":""},{"$f":"IFERROR(VLOOKUP(C6,テーブル8[],2,FALSE),\"\")","v":""}]
[{"$f":"IFERROR(VLOOKUP(C7,祝日など!$A$2:$B$88,2,FALSE),\"\")&IFERROR(VLOOKUP(C7,祝日など!$D$2:$E$39,2,FALSE),\"\")","v":"憲法記念日"},null,{"$f":"C6+1","v":"2026-05-03"},46145,{"$f":"IFERROR(VLOOKUP(C7,テーブル4[],2,0),\"\")","v":""},{"$f":"IFERROR(VLOOKUP(C7,テーブル5[],2,FALSE),\"\")","v":""},{"$f":"IFERROR(VLOOKUP(C7,テーブル83[],2,FALSE),\"\")","v":""},{"$f":"IFERROR(VLOOKUP(C7,テーブル6[],2,FALSE),\"\")","v":""},{"$f":"IFERROR(VLOOKUP(C7,テーブル7[],2,FALSE),\"\")","v":""},{"$f":"IFERROR(VLOOKUP(C7,テーブル8[],2,FALSE),\"\")","v":""}]
[{"$f":"IFERROR(VLOOKUP(C8,祝日など!$A$2:$B$88,2,FALSE),\"\")&IFERROR(VLOOKUP(C8,祝日など!$D$2:$E$39,2,FALSE),\"\")","v":"みどりの日"},null,"2026-05-04",46146,{"$f":"IFERROR(VLOOKUP(C8,テーブル4[],2,0),\"\")","v":""},{"$f":"IFERROR(VLOOKUP(C8,テーブル5[],2,FALSE),\"\")","v":""},{"$f":"IFERROR(VLOOKUP(C8,テーブル83[],2,FALSE),\"\")","v":""},{"$f":"IFERROR(VLOOKUP(C8,テーブル6[],2,FALSE),\"\")","v":""},{"$f":"IFERROR(VLOOKUP(C8,テーブル7[],2,FALSE),\"\")","v":""},{"$f":"IFERROR(VLOOKUP(C8,テーブル8[],2,FALSE),\"\")","v":""}]
[{"$f":"IFERROR(VLOOKUP(C9,祝日など!$A$2:$B$88,2,FALSE),\"\")&IFERROR(VLOOKUP(C9,祝日など!$D$2:$E$39,2,FALSE),\"\")","v":"こどもの日"},null,"2026-05-05",46147,{"$f":"IFERROR(VLOOKUP(C9,テーブル4[],2,0),\"\")","v":""},{"$f":"IFERROR(VLOOKUP(C9,テーブル5[],2,FALSE),\"\")","v":""},{"$f":"IFERROR(VLOOKUP(C9,テーブル83[],2,FALSE),\"\")","v":""},{"$f":"IFERROR(VLOOKUP(C9,テーブル6[],2,FALSE),\"\")","v":""},{"$f":"IFERROR(VLOOKUP(C9,テーブル7[],2,FALSE),\"\")","v":""},{"$f":"IFERROR(VLOOKUP(C9,テーブル8[],2,FALSE),\"\")","v":""}]
[{"$f":"IFERROR(VLOOKUP(C10,祝日など!$A$2:$B$88,2,FALSE),\"\")&IFERROR(VLOOKUP(C10,祝日など!$D$2:$E$39,2,FALSE),\"\")","v":"振替休日"},null,"2026-05-06",46148,{"$f":"IFERROR(VLOOKUP(C10,テーブル4[],2,0),\"\")","v":""},{"$f":"IFERROR(VLOOKUP(C10,テーブル5[],2,FALSE),\"\")","v":""},{"$f":"IFERROR(VLOOKUP(C10,テーブル83[],2,FALSE),\"\")","v":""},{"$f":"IFERROR(VLOOKUP(C10,テーブル6[],2,FALSE),\"\")","v":""},{"$f":"IFERROR(VLOOKUP(C10,テーブル7[],2,FALSE),\"\")","v":""},{"$f":"IFERROR(VLOOKUP(C10,テーブル8[],2,FALSE),\"\")","v":""}]
[{"$f":"IFERROR(VLOOKUP(C11,祝日など!$A$2:$B$88,2,FALSE),\"\")&IFERROR(VLOOKUP(C11,祝日など!$D$2:$E$39,2,FALSE),\"\")","v":"振替授業(火)"},null,"2026-05-07",46149,{"$f":"IFERROR(VLOOKUP(C11,テーブル4[],2,0),\"\")","v":""},{"$f":"IFERROR(VLOOKUP(C11,テーブル5[],2,FALSE),\"\")","v":""},{"$f":"IFERROR(VLOOKUP(C11,テーブル83[],2,FALSE),\"\")","v":""},{"$f":"IFERROR(VLOOKUP(C11,テーブル6[],2,FALSE),\"\")","v":""},{"$f":"IFERROR(VLOOKUP(C11,テーブル7[],2,FALSE),\"\")","v":"結晶光学演習\n（川添）"},{"$f":"IFERROR(VLOOKUP(C11,テーブル8[],2,FALSE),\"\")","v":"超高圧セミナー\n（井上・川添・高市）"}]
[{"$f":"IFERROR(VLOOKUP(C12,祝日など!$A$2:$B$88,2,FALSE),\"\")&IFERROR(VLOOKUP(C12,祝日など!$D$2:$E$39,2,FALSE),\"\")","v":""},null,"2026-05-08",46150,{"$f":"IFERROR(VLOOKUP(C12,テーブル4[],2,0),\"\")","v":""},{"$f":"IFERROR(VLOOKUP(C12,テーブル5[],2,FALSE),\"\")","v":""},{"$f":"IFERROR(VLOOKUP(C12,テーブル83[],2,FALSE),\"\")","v":""},{"$f":"IFERROR(VLOOKUP(C12,テーブル6[],2,FALSE),\"\")","v":""},{"$f":"IFERROR(VLOOKUP(C12,テーブル7[],2,FALSE),\"\")","v":"須田"},{"$f":"IFERROR(VLOOKUP(C12,テーブル8[],2,FALSE),\"\")","v":""}]
[{"$f":"IFERROR(VLOOKUP(C13,祝日など!$A$2:$B$88,2,FALSE),\"\")&IFERROR(VLOOKUP(C13,祝日など!$D$2:$E$39,2,FALSE),\"\")","v":""},null,"2026-05-09",46151,{"$f":"IFERROR(VLOOKUP(C13,テーブル4[],2,0),\"\")","v":""},{"$f":"IFERROR(VLOOKUP(C13,テーブル5[],2,FALSE),\"\")","v":""},{"$f":"IFERROR(VLOOKUP(C13,テーブル83[],2,FALSE),\"\")","v":""},{"$f":"IFERROR(VLOOKUP(C13,テーブル6[],2,FALSE),\"\")","v":""},{"$f":"IFERROR(VLOOKUP(C13,テーブル7[],2,FALSE),\"\")","v":""},{"$f":"IFERROR(VLOOKUP(C13,テーブル8[],2,FALSE),\"\")","v":""}]
[{"$f":"IFERROR(VLOOKUP(C14,祝日など!$A$2:$B$88,2,FALSE),\"\")&IFERROR(VLOOKUP(C14,祝日など!$D$2:$E$39,2,FALSE),\"\")","v":""},null,"2026-05-10",46152,{"$f":"IFERROR(VLOOKUP(C14,テーブル4[],2,0),\"\")","v":""},{"$f":"IFERROR(VLOOKUP(C14,テーブル5[],2,FALSE),\"\")","v":""},{"$f":"IFERROR(VLOOKUP(C14,テーブル83[],2,FALSE),\"\")","v":""},{"$f":"IFERROR(VLOOKUP(C14,テーブル6[],2,FALSE),\"\")","v":""},{"$f":"IFERROR(VLOOKUP(C14,テーブル7[],2,FALSE),\"\")","v":""},{"$f":"IFERROR(VLOOKUP(C14,テーブル8[],2,FALSE),\"\")","v":""}]
[{"$f":"IFERROR(VLOOKUP(C15,祝日など!$A$2:$B$88,2,FALSE),\"\")&IFERROR(VLOOKUP(C15,祝日など!$D$2:$E$39,2,FALSE),\"\")","v":""},null,"2026-05-11",46153,{"$f":"IFERROR(VLOOKUP(C15,テーブル4[],2,0),\"\")","v":""},{"$f":"IFERROR(VLOOKUP(C15,テーブル5[],2,FALSE),\"\")","v":""},{"$f":"IFERROR(VLOOKUP(C15,テーブル83[],2,FALSE),\"\")","v":""},{"$f":"IFERROR(VLOOKUP(C15,テーブル6[],2,FALSE),\"\")","v":"変形微細組織セミナー\n（安東・DUTTA）"},{"$f":"IFERROR(VLOOKUP(C15,テーブル7[],2,FALSE),\"\")","v":""},{"$f":"IFERROR(VLOOKUP(C15,テーブル8[],2,FALSE),\"\")","v":"地球外物質系輪読会\n（小池）"}]
[{"$f":"IFERROR(VLOOKUP(C16,祝日など!$A$2:$B$88,2,FALSE),\"\")&IFERROR(VLOOKUP(C16,祝日など!$D$2:$E$39,2,FALSE),\"\")","v":""},null,"2026-05-12",46154,{"$f":"IFERROR(VLOOKUP(C16,テーブル4[],2,0),\"\")","v":""},{"$f":"IFERROR(VLOOKUP(C16,テーブル5[],2,FALSE),\"\")","v":""},{"$f":"IFERROR(VLOOKUP(C16,テーブル83[],2,FALSE),\"\")","v":""},{"$f":"IFERROR(VLOOKUP(C16,テーブル6[],2,FALSE),\"\")","v":"内物学生セミナー"},{"$f":"IFERROR(VLOOKUP(C16,テーブル7[],2,FALSE),\"\")","v":"結晶光学演習\n（川添）"},{"$f":"IFERROR(VLOOKUP(C16,テーブル8[],2,FALSE),\"\")","v":"超高圧セミナー\n（井上・川添・高市）"}]
[{"$f":"IFERROR(VLOOKUP(C17,祝日など!$A$2:$B$88,2,FALSE),\"\")&IFERROR(VLOOKUP(C17,祝日など!$D$2:$E$39,2,FALSE),\"\")","v":""},null,"2026-05-13",46155,{"$f":"IFERROR(VLOOKUP(C17,テーブル4[],2,0),\"\")","v":""},{"$f":"IFERROR(VLOOKUP(C17,テーブル5[],2,FALSE),\"\")","v":""},{"$f":"IFERROR(VLOOKUP(C17,テーブル83[],2,FALSE),\"\")","v":""},{"$f":"IFERROR(VLOOKUP(C17,テーブル6[],2,FALSE),\"\")","v":""},{"$f":"IFERROR(VLOOKUP(C17,テーブル7[],2,FALSE),\"\")","v":"結晶光学演習\n（川添）"},{"$f":"IFERROR(VLOOKUP(C17,テーブル8[],2,FALSE),\"\")","v":"地球外物質学生\nセミナー（小池）"}]
[{"$f":"IFERROR(VLOOKUP(C18,祝日など!$A$2:$B$88,2,FALSE),\"\")&IFERROR(VLOOKUP(C18,祝日など!$D$2:$E$39,2,FALSE),\"\")","v":""},null,"2026-05-14",46156,{"$f":"IFERROR(VLOOKUP(C18,テーブル4[],2,0),\"\")","v":""},{"$f":"IFERROR(VLOOKUP(C18,テーブル5[],2,FALSE),\"\")","v":""},{"$f":"IFERROR(VLOOKUP(C18,テーブル83[],2,FALSE),\"\")","v":""},{"$f":"IFERROR(VLOOKUP(C18,テーブル6[],2,FALSE),\"\")","v":""},{"$f":"IFERROR(VLOOKUP(C18,テーブル7[],2,FALSE),\"\")","v":""},{"$f":"IFERROR(VLOOKUP(C18,テーブル8[],2,FALSE),\"\")","v":""}]
[{"$f":"IFERROR(VLOOKUP(C19,祝日など!$A$2:$B$88,2,FALSE),\"\")&IFERROR(VLOOKUP(C19,祝日など!$D$2:$E$39,2,FALSE),\"\")","v":""},null,"2026-05-15",{"$f":"C19","v":46157},{"$f":"IFERROR(VLOOKUP(C19,テーブル4[],2,0),\"\")","v":""},{"$f":"IFERROR(VLOOKUP(C19,テーブル5[],2,FALSE),\"\")","v":""},{"$f":"IFERROR(VLOOKUP(C19,テーブル83[],2,FALSE),\"\")","v":""},{"$f":"IFERROR(VLOOKUP(C19,テーブル6[],2,FALSE),\"\")","v":"須田"},{"$f":"IFERROR(VLOOKUP(C19,テーブル7[],2,FALSE),\"\")","v":"須田"},{"$f":"IFERROR(VLOOKUP(C19,テーブル8[],2,FALSE),\"\")","v":""}]
[{"$f":"IFERROR(VLOOKUP(C20,祝日など!$A$2:$B$88,2,FALSE),\"\")&IFERROR(VLOOKUP(C20,祝日など!$D$2:$E$39,2,FALSE),\"\")","v":""},null,"2026-05-16",46158,{"$f":"IFERROR(VLOOKUP(C20,テーブル4[],2,0),\"\")","v":""},{"$f":"IFERROR(VLOOKUP(C20,テーブル5[],2,FALSE),\"\")","v":""},{"$f":"IFERROR(VLOOKUP(C20,テーブル83[],2,FALSE),\"\")","v":""},{"$f":"IFERROR(VLOOKUP(C20,テーブル6[],2,FALSE),\"\")","v":""},{"$f":"IFERROR(VLOOKUP(C20,テーブル7[],2,FALSE),\"\")","v":""},{"$f":"IFERROR(VLOOKUP(C20,テーブル8[],2,FALSE),\"\")","v":""}]
{"$rows_left_out":16}
{"sheet":"祝日など","index":1,"n_rows":88,"n_cols":5,"rows_kept":88,"cut":false,"hidden":false,"merged":[]}
["祝日の日付","名称",null,"授業関係日付","授業関係"]
["2025-01-01","元日",null,"2025-04-03","入学式"]
["2025-01-02","休日",null,"2025-04-08","第1ターム開始"]
["2025-01-03","休日",null,"2025-05-01","振替授業(火)"]
["2025-01-13","成人の日",null,"2025-05-07","振替授業(月)"]
["2025-02-11","建国記念の日",null,"2025-06-06","第2ターム開始"]
["2025-02-23","天皇誕生日",null,"2025-07-18","振替授業(月)"]
["2025-02-24","振替休日",null,"2025-08-04","夏季休暇開始"]
["2025-03-20","春分の日",null,"2025-09-19","秋季\n学位記授与式"]
["2025-04-29","昭和の日",null,"2025-10-01","秋季入学式"]
["2025-05-03","憲法記念日",null,"2025-10-02","第3ターム開始"]
["2025-05-04","みどりの日",null,"2025-10-16","振替授業(月)"]
["2025-05-05","こどもの日",null,"2025-11-07","振替授業(月)"]
["2025-05-06","振替休日",null,"2025-12-02","第4ターム開始"]
["2025-07-21","海の日",null,"2025-12-25","振替授業(金)"]
["2025-08-11","山の日",null,"2026-01-06","振替授業(月)"]
["2025-08-12","夏季休業",null,"2026-01-14","振替授業(月)"]
["2025-08-13","夏季休業",null,"2026-01-17","大学入学\n共通テスト"]
["2025-08-14","夏季休業",null,"2026-01-18","大学入学\n共通テスト"]
["2025-08-15","夏季休業",null,"2026-02-09","春季休暇開始"]
{"$rows_left_out":69}
{"sheet":"9-10時限","index":2,"n_rows":78,"n_cols":2,"rows_kept":78,"cut":false,"hidden":false,"merged":[]}
["日付","9-10時限"]
["2025-04-08","超高圧セミナー\n（井上・川添・高市）"]
["2025-04-15","超高圧セミナー\n（井上・川添・高市）"]
["2025-04-22","超高圧セミナー\n（井上・川添・高市）"]
["2025-05-01","超高圧セミナー\n（井上・川添・高市）"]
["2025-05-13","超高圧セミナー\n（井上・川添・高市）"]
["2025-05-20","超高圧セミナー\n（井上・川添・高市）"]
["2025-05-27","超高圧セミナー\n（井上・川添・高市）"]
["2025-06-03","超高圧セミナー\n（井上・川添・高市）"]
["2025-07-01","超高圧セミナー\n（井上・川添・高市）"]
["2025-07-05","地学実験A"]
["2025-07-14","企業説明会・三菱ガス化学㈱\n15：00-17：00（秋澤）"]
["2025-08-08","←　DAS　→"]
["2025-08-31","全学停電（8：30～18：00）"]
["2025-09-01","薮田セミナー"]
["2025-10-07","超高圧セミナー\n（井上・川添・高市）"]
["2025-10-14","超高圧セミナー\n（井上・川添・高市）"]
["2025-10-21","超高圧セミナー\n（井上・川添・高市）"]
["2025-10-28","超高圧セミナー\n（井上・川添・高市）"]
["2025-11-04","超高圧セミナー\n（井上・川添・高市）"]
{"$rows_left_out":59}
{"sheet":"7-8時限","index":3,"n_rows":106,"n_cols":2,"rows_kept":106,"cut":false,"hidden":false,"merged":[]}
["日付","7-8時限"]
["2025-04-08","結晶光学演習\n（片山）"]
["2025-04-09","結晶光学演習\n（片山）"]
["2025-04-15","結晶光学演習\n（片山）"]
["2025-04-16","結晶光学演習\n（片山）"]
["2025-04-22","結晶光学演習\n（片山）"]
["2025-04-23","結晶光学演習\n（片山）"]
["2025-04-30","結晶光学演習\n（片山）"]
["2025-05-01","結晶光学演習\n（片山）"]
["2025-05-13","結晶光学演習\n（片山）"]
["2025-05-14","結晶光学演習\n（片山）"]
["2025-05-20","結晶光学演習\n（片山）"]
["2025-05-21","結晶光学演習\n（片山）"]
["2025-05-27","結晶光学演習\n（片山）"]
["2025-05-28","結晶光学演習\n（片山）"]
["2025-06-03","結晶光学演習\n（片山）"]
["2025-06-04","結晶光学演習\n（片山）"]
["2025-06-10","超高圧セミナー\n（井上・川添・高市）"]
["2025-06-12","岩石変形学Ⅰ\n（片山）"]
["2025-06-17","超高圧セミナー\n（井上・川添・高市）"]
{"$rows_left_out":87}
{"sheet":"5-6時限","index":4,"n_rows":96,"n_cols":2,"rows_kept":96,"cut":false,"hidden":false,"merged":[]}
["日付","5-6時限"]
["2025-04-14","地球惑星物質学セミナー\n（安東・DAS・大川）"]
["2025-04-21","地球惑星物質学セミナー\n（安東・DAS・大川）"]
["2025-04-28","地球惑星物質学セミナー\n（安東・DAS・大川）"]
["2025-05-07","地球惑星物質学セミナー\n（安東・DAS・大川）"]
["2025-05-12","地球惑星物質学セミナー\n（安東・DAS・大川）"]
["2025-05-19","地球惑星物質学セミナー\n（安東・DAS・大川）"]
["2025-05-26","地球惑星物質学セミナー\n（安東・DAS・大川）"]
["2025-06-02","地球惑星物質学セミナー\n（安東・DAS・大川）"]
["2025-06-09","地球惑星物質学セミナー\n（安東・DAS・大川）"]
["2025-06-16","地球惑星物質学セミナー\n（安東・DAS・大川）"]
["2025-06-23","地球惑星物質学セミナー\n（安東・DAS・大川）"]
["2025-06-30","地球惑星物質学セミナー\n（安東・DAS・大川）"]
["2025-07-05","地学実験A"]
["2025-07-07","地球惑星物質学セミナー\n（安東・DAS・大川）"]
["2025-07-14","地球惑星物質学セミナー\n（安東・DAS・大川）"]
["2025-07-18","地球惑星物質学セミナー\n（安東・DAS・大川）"]
["2025-07-28","地球惑星物質学セミナー\n（安東・DAS・大川）"]
["2025-08-31","全学停電（8：30～18：00）"]
["2025-09-03","←　DAS　→"]
{"$rows_left_out":77}
{"sheet":"昼休憩","index":5,"n_rows":15,"n_cols":2,"rows_kept":15,"cut":false,"hidden":false,"merged":[]}
["日付","昼休憩"]
["2025-07-12","安東"]
["2025-08-31","停電"]
["2025-09-03","DAS"]
["2025-12-20","停電"]
["2025-12-21","停電"]
["2026-02-21","停電"]
["2026-02-22","停電"]
["2026-03-05","点検"]
["2026-03-12","試験"]
["2026-04-16","岡﨑"]
["2026-05-18","DUTTA"]
["2026-07-04","地学\n実験A"]
["2026-08-30","停電"]
["2027-03-12","試験"]

{"sheet":"3-4時限","index":6,"n_rows":54,"n_cols":2,"rows_kept":54,"cut":false,"hidden":false,"merged":[]}
["日付","3-4時限"]
["2025-07-05","地学実験A"]
["2025-06-10","岩石変形学Ⅰ\n（片山）"]
["2025-06-17","岩石変形学Ⅰ\n（片山）"]
["2025-06-24","岩石変形学Ⅰ\n（片山）"]
["2025-07-05","地学実験A"]
["2025-07-08","岩石変形学Ⅰ\n（片山）"]
["2025-07-10","←　DAS　→"]
["2025-07-12","←　安東　→"]
["2025-07-15","岩石変形学Ⅰ\n（片山）"]
["2025-07-22","岩石変形学Ⅰ\n（片山）"]
["2025-07-29","岩石変形学Ⅰ\n（片山）"]
["2025-08-08","←　DAS　→"]
["2025-08-31","全学停電（8：30～18：00）"]
["2025-09-01","薮田研セミナー"]
["2025-09-03","←　DAS　→"]
["2025-10-02","地球史\n(DAS･白石･柴田･DUTTA 他)"]
["2025-10-07","PRDセミナー\n(安東・DAS･DUTTA)"]
["2025-10-09","地球史\n(DAS･白石･柴田･DUTTA 他)"]
["2025-10-14","PRDセミナー\n(安東・DAS･DUTTA)"]
{"$rows_left_out":35}
{"sheet":"1-2時限","index":7,"n_rows":25,"n_cols":2,"rows_kept":25,"cut":false,"hidden":false,"merged":[]}
["日付","1-2時限"]
["2025-07-05","地学実験A"]
["2025-08-08","←　DAS　→"]
["2025-08-31","全学停電（8：30～18：00）"]
["2025-10-02","地球史\n(DAS･白石･柴田･DUTTA 他)"]
["2025-10-09","地球史\n(DAS･白石･柴田･DUTTA 他)"]
["2025-10-23","地球史\n(DAS･白石･柴田･DUTTA 他)"]
["2025-10-24","薮田研セミナー"]
["2025-10-30","地球史\n(DAS･白石･柴田･DUTTA 他)"]
["2025-10-31","薮田研セミナー"]
["2025-11-06","地球史\n(DAS･白石･柴田･DUTTA 他)"]
["2025-11-13","地球史\n(DAS･白石･柴田･DUTTA 他)"]
["2025-11-20","地球史\n(DAS･白石･柴田･DUTTA 他)"]
["2025-11-27","地球史\n(DAS･白石･柴田･DUTTA 他)"]
["2025-12-20","改修用停電"]
["2025-12-21","改修用停電"]
["2026-01-16","薮田研セミナー"]
["2026-02-21","改修用停電"]
["2026-02-22","改修用停電"]
["2026-03-05","顕微鏡点検"]
{"$rows_left_out":6}
{"sheet":"セミナー","index":8,"n_rows":743,"n_cols":9,"rows_kept":743,"cut":false,"hidden":false,"merged":[]}
["日付","曜日","祝日など","1-2時限","3-4時限","昼休憩","5-6時限","7-8時限","9-10時限"]
["2025-04-01","(火)",{"$f":"IFERROR(VLOOKUP(A2,テーブル1[],2,FALSE),\"\")&IFERROR(VLOOKUP(A2,祝日など!$D$2:$E$20,2,FALSE),\"\")","v":""}]
["2025-04-02","(水)",{"$f":"IFERROR(VLOOKUP(A3,テーブル1[],2,FALSE),\"\")&IFERROR(VLOOKUP(A3,祝日など!$D$2:$E$20,2,FALSE),\"\")","v":""}]
["2025-04-03","(木)",{"$f":"IFERROR(VLOOKUP(A4,テーブル1[],2,FALSE),\"\")&IFERROR(VLOOKUP(A4,祝日など!$D$2:$E$20,2,FALSE),\"\")","v":"入学式"}]
["2025-04-04","(金)",{"$f":"IFERROR(VLOOKUP(A5,テーブル1[],2,FALSE),\"\")&IFERROR(VLOOKUP(A5,祝日など!$D$2:$E$20,2,FALSE),\"\")","v":""}]
["2025-04-05","(土)",{"$f":"IFERROR(VLOOKUP(A6,テーブル1[],2,FALSE),\"\")&IFERROR(VLOOKUP(A6,祝日など!$D$2:$E$20,2,FALSE),\"\")","v":""}]
["2025-04-06","(日)",{"$f":"IFERROR(VLOOKUP(A7,テーブル1[],2,FALSE),\"\")&IFERROR(VLOOKUP(A7,祝日など!$D$2:$E$20,2,FALSE),\"\")","v":""}]
["2025-04-07","(月)",{"$f":"IFERROR(VLOOKUP(A8,テーブル1[],2,FALSE),\"\")&IFERROR(VLOOKUP(A8,祝日など!$D$2:$E$20,2,FALSE),\"\")","v":""}]
["2025-04-08","(火)",{"$f":"IFERROR(VLOOKUP(A9,テーブル1[],2,FALSE),\"\")&IFERROR(VLOOKUP(A9,祝日など!$D$2:$E$20,2,FALSE),\"\")","v":"第1ターム開始"},null,null,null,null,"結晶光学演習\n（片山）","超高圧セミナー\n（井上・川添・高市）"]
["2025-04-09","(水)",{"$f":"IFERROR(VLOOKUP(A10,テーブル1[],2,FALSE),\"\")&IFERROR(VLOOKUP(A10,祝日など!$D$2:$E$20,2,FALSE),\"\")","v":""},null,null,null,null,"結晶光学演習\n（片山）"]
["2025-04-10","(木)",{"$f":"IFERROR(VLOOKUP(A11,テーブル1[],2,FALSE),\"\")&IFERROR(VLOOKUP(A11,祝日など!$D$2:$E$20,2,FALSE),\"\")","v":""}]
["2025-04-11","(金)",{"$f":"IFERROR(VLOOKUP(A12,テーブル1[],2,FALSE),\"\")&IFERROR(VLOOKUP(A12,祝日など!$D$2:$E$20,2,FALSE),\"\")","v":""}]
["2025-04-12","(土)",{"$f":"IFERROR(VLOOKUP(A13,テーブル1[],2,FALSE),\"\")&IFERROR(VLOOKUP(A13,祝日など!$D$2:$E$20,2,FALSE),\"\")","v":""}]
["2025-04-13","(日)",{"$f":"IFERROR(VLOOKUP(A14,テーブル1[],2,FALSE),\"\")&IFERROR(VLOOKUP(A14,祝日など!$D$2:$E$20,2,FALSE),\"\")","v":""}]
["2025-04-14","(月)",{"$f":"IFERROR(VLOOKUP(A15,テーブル1[],2,FALSE),\"\")&IFERROR(VLOOKUP(A15,祝日など!$D$2:$E$20,2,FALSE),\"\")","v":""},null,null,null,"地球惑星物質学セミナー\n（安東・DAS・大川）"]
["2025-04-15","(火)",{"$f":"IFERROR(VLOOKUP(A16,テーブル1[],2,FALSE),\"\")&IFERROR(VLOOKUP(A16,祝日など!$D$2:$E$20,2,FALSE),\"\")","v":""},null,null,null,null,"結晶光学演習\n（片山）","超高圧セミナー\n（井上・川添・高市）"]
["2025-04-16","(水)",{"$f":"IFERROR(VLOOKUP(A17,テーブル1[],2,FALSE),\"\")&IFERROR(VLOOKUP(A17,祝日など!$D$2:$E$20,2,FALSE),\"\")","v":""},null,null,null,null,"結晶光学演習\n（片山）"]
["2025-04-17","(木)",{"$f":"IFERROR(VLOOKUP(A18,テーブル1[],2,FALSE),\"\")&IFERROR(VLOOKUP(A18,祝日など!$D$2:$E$20,2,FALSE),\"\")","v":""}]
["2025-04-18","(金)",{"$f":"IFERROR(VLOOKUP(A19,テーブル1[],2,FALSE),\"\")&IFERROR(VLOOKUP(A19,祝日など!$D$2:$E$20,2,FALSE),\"\")","v":""}]
["2025-04-19","(土)",{"$f":"IFERROR(VLOOKUP(A20,テーブル1[],2,FALSE),\"\")&IFERROR(VLOOKUP(A20,祝日など!$D$2:$E$20,2,FALSE),\"\")","v":""}]
{"$rows_left_out":723}